1,2,4,5-[2.2.2.2]Cyclophane
- Formula: C20H20
- Molecular weight: 260.3728
- IUPAC Standard InChIKey: VKBBYQHRVDUAIS-UHFFFAOYSA-N
- CAS Registry Number: 54100-59-3
- Chemical structure:
View 3d structure (requires JavaScript / HTML 5) - Other names: [2.2.2.2](1,2,4,5)Cyclophane

Gas phase ion energetics data

Data compiled by: Sharon G. Lias, Rhoda D. Levin, and Sherif A. Kafafi
Ionization energy determinations
IE (eV) | Method | Reference | Comment |
---|---|---|---|
7.35 | PE | Zhong-zhi, Heilbronner, et al., 1981 | |
7.67 ± 0.02 | PE | Kovac, Mohraz, et al., 1980 | Vertical value |

References

Zhong-zhi, Heilbronner, et al., 1981
Zhong-zhi, Y.; Heilbronner, E.; Kang, H.C.; Boekelheide, V.,
The photoelectron spectra of 4,13-diaza- and 4,16-diaza[2,4](1,2,4,5)cyclophanes,
Helv. Chim. Acta, 1981, 64, 2029. [all data]
Kovac, Mohraz, et al., 1980
Kovac, B.; Mohraz, M.; Heilbronner, E.; Boekelheide, V.; Hopf, H.,
Photoelectron spectra of the cyclophanes,
J. Am. Chem. Soc., 1980, 102, 4314. [all data]