Pentane, 2,2,4-trimethyl-
- Formula: C8H18
- Molecular weight: 114.2285
- IUPAC Standard InChIKey: NHTMVDHEPJAVLT-UHFFFAOYSA-N
- CAS Registry Number: 540-84-1
- Chemical structure:
View 3d structure (requires JavaScript / HTML 5) - Other names: Isooctane; Isobutyltrimethylmethane; 2,2,4-Trimethylpentane; (CH3)2CHCH2C(CH3)3; Isobutyltrimethylethane; UN 1262

Gas phase thermochemistry data

Data compiled as indicated in comments:
ALS - Hussein Y. Afeefy, Joel F. Liebman, and Stephen E. Stein
GT - Glushko Thermocenter, Russian Academy of Sciences, Moscow
Quantity | Value | Units | Method | Reference | Comment |
---|---|---|---|---|---|
ΔfH°gas | -224.1 ± 1.3 | kJ/mol | Ccb | Prosen and Rossini, 1945 | ALS |
Constant pressure heat capacity of gas
Cp,gas (J/mol*K) | Temperature (K) | Reference | Comment |
---|---|---|---|
130.58 | 200. | Scott D.W., 1974 | Recommended values were obtained from the consistent correlation scheme for alkanes [ Scott D.W., 1974, 2, Scott D.W., 1974]. This approach gives a good agreement with experimental data available for alkanes. However, large uncertainties could be expected at high temperatures.; GT |
173.97 | 273.15 | ||
188.4 ± 0.4 | 298.15 | ||
189.45 | 300. | ||
244.60 | 400. | ||
293.42 | 500. | ||
335.56 | 600. | ||
371.96 | 700. | ||
403.34 | 800. | ||
430.53 | 900. | ||
454.80 | 1000. | ||
475.72 | 1100. | ||
494.55 | 1200. | ||
510.45 | 1300. | ||
527.18 | 1400. | ||
539.74 | 1500. |

Condensed phase thermochemistry data

Data compiled as indicated in comments:
ALS - Hussein Y. Afeefy, Joel F. Liebman, and Stephen E. Stein
DH - Eugene S. Domalski and Elizabeth D. Hearing
Quantity | Value | Units | Method | Reference | Comment |
---|---|---|---|---|---|
ΔfH°liquid | -259.3 ± 1.3 | kJ/mol | Ccb | Prosen and Rossini, 1945 | ALS |
Quantity | Value | Units | Method | Reference | Comment |
ΔcH°liquid | -5461.3 ± 1.3 | kJ/mol | Ccb | Prosen and Rossini, 1945 | Corresponding ΔfHºliquid = -259.2 kJ/mol (simple calculation by NIST; no Washburn corrections); ALS |
Quantity | Value | Units | Method | Reference | Comment |
S°liquid | 328.03 | J/mol*K | N/A | Pitzer K.S., 1940 | DH |
S°liquid | 314.6 | J/mol*K | N/A | Parks, Huffman, et al., 1930 | Extrapolation below 90 K, 66.53 J/mol*K.; DH |
Constant pressure heat capacity of liquid
Cp,liquid (J/mol*K) | Temperature (K) | Reference | Comment |
---|---|---|---|
242.49 | 298.15 | Costas, Huu, et al., 1988 | DH |
242.49 | 298.15 | Perez-Casas, Aicart, et al., 1988 | DH |
239.71 | 298.15 | Shiohama, Ogawa, et al., 1988 | DH |
237.85 | 293.15 | Kalali, Kohler, et al., 1987 | T = 293.15, 313.15 K.; DH |
238.871 | 298.15 | Fortier and Benson, 1976 | Average of three values.; DH |
237.8 | 298.15 | Rajagopal and Subrahmanyam, 1974 | T = 298.15 to 323.15 K.; DH |
237.8 | 298.15 | Subrahmanyam and Rajagopal, 1973 | T = 298 to 323 K.; DH |
233.7 | 300. | Auerbach, Sage, et al., 1950 | T = 300 to 366 K. Cp given as 0.4980 Btu/lb*R at 80 F.; DH |
238.57 | 298.15 | Osborne and Ginnings, 1947 | T = 283 to 318 K.; DH |
241.00 | 301.9 | Pitzer K.S., 1940 | T = 15 to 318 K. Value is unsmoothed experimental datum.; DH |
233.9 | 295.2 | Parks, Huffman, et al., 1930 | T = 88 to 295 K. Value is unsmoothed experimental datum.; DH |

Phase change data

Data compiled as indicated in comments:
TRC - Thermodynamics Research Center, NIST Boulder Laboratories, Chris Muzny director
BS - Robert L. Brown and Stephen E. Stein
AC - William E. Acree, Jr., James S. Chickos
ALS - Hussein Y. Afeefy, Joel F. Liebman, and Stephen E. Stein
DH - Eugene S. Domalski and Elizabeth D. Hearing
Quantity | Value | Units | Method | Reference | Comment |
---|---|---|---|---|---|
Tboil | 372.4 ± 0.2 | K | AVG | N/A | Average of 49 out of 52 values; Individual data points |
Quantity | Value | Units | Method | Reference | Comment |
Tfus | 165.77 ± 0.06 | K | AVG | N/A | Average of 37 out of 44 values; Individual data points |
Quantity | Value | Units | Method | Reference | Comment |
Ttriple | 165.760 | K | N/A | Streiff, 1959 | Uncertainty assigned by TRC = 0.4 K; TRC |
Ttriple | 165.3 | K | N/A | Parks, Huffman, et al., 1930, 2 | Uncertainty assigned by TRC = 0.2 K; TRC |
Quantity | Value | Units | Method | Reference | Comment |
Tc | 543.9 ± 0.4 | K | AVG | N/A | Average of 6 values; Individual data points |
Quantity | Value | Units | Method | Reference | Comment |
Pc | 25.7 ± 0.2 | bar | N/A | Daubert, 1996 | |
Pc | 25.676 | bar | N/A | McMicking and Kay, 1965 | Uncertainty assigned by TRC = 0.4053 bar; TRC |
Pc | 25.6433 | bar | N/A | Kay and Warzel, 1951 | Uncertainty assigned by TRC = 0.1013 bar; TRC |
Pc | 25.8379 | bar | N/A | Beattie and Edwards, 1948 | Uncertainty assigned by TRC = 0.1519 bar; from observed isotherms in critical region; TRC |
Quantity | Value | Units | Method | Reference | Comment |
Vc | 0.468 | l/mol | N/A | Daubert, 1996 | |
Vc | 0.482 | l/mol | N/A | Beattie and Edwards, 1948 | Uncertainty assigned by TRC = 0.02 l/mol; from observed isotherms in the critical region; TRC |
Quantity | Value | Units | Method | Reference | Comment |
ρc | 2.14 ± 0.02 | mol/l | N/A | Daubert, 1996 | |
ρc | 2.13 | mol/l | N/A | McMicking and Kay, 1965 | Uncertainty assigned by TRC = 0.04 mol/l; TRC |
ρc | 2.13 | mol/l | N/A | Kay and Warzel, 1951 | Uncertainty assigned by TRC = 0.03 mol/l; TRC |
Quantity | Value | Units | Method | Reference | Comment |
ΔvapH° | 35.1 ± 0.2 | kJ/mol | AVG | N/A | Average of 7 values; Individual data points |
Enthalpy of vaporization
ΔvapH (kJ/mol) | Temperature (K) | Method | Reference | Comment |
---|---|---|---|---|
30.79 | 372.4 | N/A | Majer and Svoboda, 1985 | |
36.1 | 304. | N/A | Wu, Pividal, et al., 1991 | Based on data from 289. to 333. K.; AC |
31.6 | 438. | A | Stephenson and Malanowski, 1987 | Based on data from 423. to 523. K.; AC |
32.2 | 387. | A | Stephenson and Malanowski, 1987 | Based on data from 372. to 416. K.; AC |
31.5 | 428. | A | Stephenson and Malanowski, 1987 | Based on data from 413. to 494. K.; AC |
31.4 | 505. | A | Stephenson and Malanowski, 1987 | Based on data from 490. to 544. K.; AC |
40.7 | 209. | A | Stephenson and Malanowski, 1987 | Based on data from 194. to 299. K. See also Milazzo, 1956.; AC |
34.8 | 312. | A,MM | Stephenson and Malanowski, 1987 | Based on data from 297. to 374. K. See also Willingham, Taylor, et al., 1945.; AC |
34.4 ± 0.1 | 313. | C | Svoboda, Charvátová, et al., 1982 | AC |
33.4 ± 0.1 | 328. | C | Svoboda, Charvátová, et al., 1982 | AC |
32.6 ± 0.1 | 343. | C | Svoboda, Charvátová, et al., 1982 | AC |
31.7 ± 0.1 | 358. | C | Svoboda, Charvátová, et al., 1982 | AC |
31.0 ± 0.1 | 368. | C | Svoboda, Charvátová, et al., 1982 | AC |
34.3 ± 0.1 | 313. | C | Majer, Svoboda, et al., 1979 | AC |
33.2 ± 0.1 | 333. | C | Majer, Svoboda, et al., 1979 | AC |
32.0 ± 0.1 | 353. | C | Majer, Svoboda, et al., 1979 | AC |
31.0 | 371. | C | Pitzer K.S., 1940 | AC |
33.9 | 333. | EB | Smith, 1940 | Based on data from 318. to 399. K.; AC |
Enthalpy of vaporization
ΔvapH =
A exp(-βTr) (1 − Tr)β
ΔvapH =
Enthalpy of vaporization (at saturation pressure)
(kJ/mol)
Tr = reduced temperature (T / Tc)
View plot Requires a JavaScript / HTML 5 canvas capable browser.
Temperature (K) | A (kJ/mol) | β | Tc (K) | Reference | Comment |
---|---|---|---|---|---|
298. to 353. | 50.28 | 0.2668 | 543.9 | Majer and Svoboda, 1985 |
Antoine Equation Parameters
log10(P) = A − (B / (T + C))
P = vapor pressure (bar)
T = temperature (K)
View plot Requires a JavaScript / HTML 5 canvas capable browser.
Temperature (K) | A | B | C | Reference | Comment |
---|---|---|---|---|---|
194.64 to 298.44 | 3.94736 | 1282.332 | -48.444 | Milazzo, 1956, 2 | Coefficents calculated by NIST from author's data. |
297.51 to 373.28 | 3.93679 | 1257.84 | -52.415 | Williamham, Taylor, et al., 1945 |
Enthalpy of fusion
ΔfusH (kJ/mol) | Temperature (K) | Reference | Comment |
---|---|---|---|
9.2115 | 165.79 | Pitzer K.S., 1940 | DH |
9.04 | 165.3 | Domalski and Hearing, 1996 | AC |
9.042 | 165.3 | Parks, Huffman, et al., 1930 | DH |
Entropy of fusion
ΔfusS (J/mol*K) | Temperature (K) | Reference | Comment |
---|---|---|---|
55.56 | 165.79 | Pitzer K.S., 1940 | DH |
54.70 | 165.3 | Parks, Huffman, et al., 1930 | DH |

Reaction thermochemistry data

Data compiled by: Hussein Y. Afeefy, Joel F. Liebman, and Stephen E. Stein
Individual Reactions
By formula: C8H16 + H2 = C8H18
Quantity | Value | Units | Method | Reference | Comment |
---|---|---|---|---|---|
ΔrH° | -107. | kJ/mol | Chyd | Turner, Nettleton, et al., 1958 | liquid phase; solvent: Acetic acid |
ΔrH° | -112.9 ± 0.3 | kJ/mol | Chyd | Dolliver, Gresham, et al., 1937 | gas phase; Reanalyzed by Cox and Pilcher, 1970, Original value = -114.0 ± 0.3 kJ/mol; At 355 °K |
ΔrH° | -119.6 ± 3.3 | kJ/mol | Chyd | Crawford and Parks, 1936 | liquid phase |
By formula: C8H16 + H2 = C8H18
Quantity | Value | Units | Method | Reference | Comment |
---|---|---|---|---|---|
ΔrH° | -112. | kJ/mol | Chyd | Turner, Nettleton, et al., 1958 | liquid phase; solvent: Acetic acid |
ΔrH° | -118.8 | kJ/mol | Chyd | Dolliver, Gresham, et al., 1937 | gas phase; At 355 °K |
By formula: C8H18 = C8H18
Quantity | Value | Units | Method | Reference | Comment |
---|---|---|---|---|---|
ΔrH° | -9.4 ± 1.0 | kJ/mol | Ciso | Prosen and Rossini, 1945, 2 | liquid phase; Calculated from ΔHc |

Gas phase ion energetics data

Data evaluated as indicated in comments:
L - Sharon G. Lias
Data compiled as indicated in comments:
RDSH - Henry M. Rosenstock, Keith Draxl, Bruce W. Steiner, and John T. Herron
Quantity | Value | Units | Method | Reference | Comment |
---|---|---|---|---|---|
IE (evaluated) | 9.89 ± 0.03 | eV | N/A | N/A | L |
Ionization energy determinations
IE (eV) | Method | Reference | Comment |
---|---|---|---|
9.91 | PE | Al-Joboury and Turner, 1964 | RDSH |
9.86 | PI | Watanabe, Nakayama, et al., 1962 | RDSH |

Kovats' RI, non-polar column, isothermal

Column type | Active phase | Temperature (C) | I | Reference | Comment |
---|---|---|---|---|---|
Capillary | HP-1 | 0. | 692.7 | Wang, Liu, et al., 2005 | 30. m/0.25 mm/0.25 μm |
Capillary | HP-1 | 10. | 689.1 | Wang, Liu, et al., 2005 | 30. m/0.25 mm/0.25 μm |
Capillary | HP-1 | 20. | 694. | Wang, Liu, et al., 2005 | 30. m/0.25 mm/0.25 μm |
Capillary | HP-1 | 30. | 691.1 | Wang, Liu, et al., 2005 | 30. m/0.25 mm/0.25 μm |
Capillary | HP-1 | 40. | 689.9 | Wang, Liu, et al., 2005 | 30. m/0.25 mm/0.25 μm |
Capillary | HP-1 | 50. | 690.2 | Wang, Liu, et al., 2005 | 30. m/0.25 mm/0.25 μm |
Capillary | HP-1 | 60. | 690.6 | Wang, Liu, et al., 2005 | 30. m/0.25 mm/0.25 μm |
Packed | PMS-1000 | 90. | 693. | Arutyunov, Kudryashov, et al., 2004 | N2, Chromaton N-AW-DMCS; Column length: 2. m |
Capillary | Methyl Silicone | 150. | 700. | Berezkin, Korolev, et al., 2002 | He; Column length: 15. m; Column diameter: 0.24 mm |
Packed | C78, Branched paraffin | 130. | 694.9 | Dallos, Sisak, et al., 2000 | He; Column length: 3.3 m |
Capillary | Squalane | 100. | 691. | Heinzen, Soares, et al., 1999 | |
Packed | Squalane | 78.5 | 693.5 | Zhang and Lu, 1996 | |
Capillary | OV-101 | 150. | 697.7 | Cha and Lee, 1994 | Column length: 20. m; Column diameter: 0.5 mm |
Capillary | OV-101 | 180. | 703.1 | Cha and Lee, 1994 | Column length: 20. m; Column diameter: 0.5 mm |
Capillary | Squalane | 25. | 687. | Hilal, Carreira, et al., 1994 | |
Packed | C78, Branched paraffin | 130. | 694.1 | Reddy, Dutoit, et al., 1992 | Chromosorb G HP; Column length: 3.3 m |
Packed | Apolane | 130. | 694. | Dutoit, 1991 | Column length: 3.7 m |
Capillary | OV-1 | 60. | 691. | Engewald, Maurer, et al., 1989 | |
Capillary | OV-101 | 40. | 689. | Laub and Purnell, 1988 | |
Capillary | OV-101 | 60. | 691. | Laub and Purnell, 1988 | |
Capillary | OV-101 | 80. | 694. | Laub and Purnell, 1988 | |
Capillary | Squalane | 50. | 689.9 | Lunskii and Paizanskaya, 1988 | He; Column length: 50. m; Column diameter: 0.22 mm |
Capillary | Squalane | 70. | 692.2 | Lunskii and Paizanskaya, 1988 | He; Column length: 50. m; Column diameter: 0.22 mm |
Packed | Squalane | 80. | 693. | Fernández-Sánchez, García-Domínguez, et al., 1987 | H2 |
Capillary | Nonpolar | 45. | 690. | Stoyanov and Dimov, 1987 | |
Capillary | Nonpolar | 52.5 | 690. | Stoyanov and Dimov, 1987 | |
Capillary | Nonpolar | 55. | 691. | Stoyanov and Dimov, 1987 | |
Capillary | Nonpolar | 60. | 691. | Stoyanov and Dimov, 1987 | |
Capillary | Nonpolar | 60. | 691. | Stoyanov and Dimov, 1987 | |
Capillary | Nonpolar | 65. | 692. | Stoyanov and Dimov, 1987 | |
Packed | SE-30 | 150. | 695. | Tiess, 1984 | Ar, Gas Chrom Q (80-100 mesh); Column length: 3. m |
Capillary | OV-101 | 30. | 688. | Chien, Furio, et al., 1983 | |
Capillary | OV-101 | 40. | 689. | Chien, Furio, et al., 1983 | |
Capillary | OV-101 | 50. | 690. | Chien, Furio, et al., 1983 | |
Capillary | OV-101 | 60. | 691. | Chien, Furio, et al., 1983 | |
Capillary | OV-101 | 70. | 692. | Chien, Furio, et al., 1983 | |
Capillary | OV-101 | 80. | 694. | Chien, Furio, et al., 1983 | |
Capillary | OV-3 | 30. | 686.6 | Chien, Furio, et al., 1983, 2 | |
Capillary | OV-3 | 40. | 687.5 | Chien, Furio, et al., 1983, 2 | |
Capillary | OV-3 | 50. | 688.6 | Chien, Furio, et al., 1983, 2 | |
Capillary | OV-3 | 60. | 689.6 | Chien, Furio, et al., 1983, 2 | |
Capillary | OV-3 | 70. | 690.7 | Chien, Furio, et al., 1983, 2 | |
Capillary | OV-3 | 80. | 691.9 | Chien, Furio, et al., 1983, 2 | |
Capillary | DB-1 | 60. | 691.4 | Lubeck and Sutton, 1983 | Column length: 60. m; Column diameter: 0.264 mm |
Capillary | DB-1 | 60. | 691.3 | Lubeck and Sutton, 1983 | 60. m/0.259 mm/1. μm |
Capillary | OV-101 | 50. | 689. | Johansen and Ettre, 1982 | 100. m/0.27 mm/0.20 μm |
Capillary | OV-101 | 50. | 690. | Johansen and Ettre, 1982 | 55. m/0.27 mm/0.9 μm |
Capillary | SF-96 | 50. | 690. | Johansen and Ettre, 1982 | 91.4 m/0.31 mm/0.20 μm |
Packed | Squalane | 100. | 696. | Nabivach and Kirilenko, 1980 | He, Chromaton N-AW-HMDS; Column length: 1. m |
Packed | Triacontane | 80. | 691. | Castello and D'Amato, 1979 | He, Chromosorb W AW (60-80 mesh); Column length: 3. m |
Packed | Squalane | 80. | 694. | Castello and D'Amato, 1979 | He, Chromosorb W AW (60-80 mesh); Column length: 3. m |
Packed | SE-30 | 80. | 693. | Dimov and Papazova, 1979 | Chromosorb W AW DMCS (80-100 mesh); Column length: 4. m |
Capillary | Squalane | 60. | 691. | Chretien and Dubois, 1976 | |
Packed | Apolane | 70. | 688.6 | Riedo, Fritz, et al., 1976 | He, Chromosorb; Column length: 2.4 m |
Capillary | Squalane | 50. | 690. | Rijks and Cramers, 1974 | N2; Column length: 100. m; Column diameter: 0.25 mm |
Capillary | Squalane | 70. | 692. | Rijks and Cramers, 1974 | N2; Column length: 100. m; Column diameter: 0.25 mm |
Capillary | Vacuum Grease Oil (VM-4) | 35. | 684. | Sidorov, Petrova, et al., 1972 | |
Capillary | Vacuum Grease Oil (VM-4) | 45. | 686. | Sidorov, Petrova, et al., 1972 | |
Capillary | Vacuum Grease Oil (VM-4) | 50. | 686. | Sidorov, Petrova, et al., 1972 | |
Capillary | Vacuum Grease Oil (VM-4) | 58. | 687. | Sidorov, Petrova, et al., 1972 | |
Capillary | Vacuum Grease Oil (VM-4) | 68. | 688. | Sidorov, Petrova, et al., 1972 | |
Capillary | Squalane | 70. | 690.3 | Dimov and Schopov, 1971 | Column length: 100. m; Column diameter: 0.25 mm |
Packed | SE-30 | 75. | 695. | Robinson and Odell, 1971 | N2, Chromosorb W; Column length: 6.1 m |
Packed | Squalane | 100. | 699. | Robinson and Odell, 1971 | N2, Embacel; Column length: 3.0 m |
Packed | Squalane | 25. | 687. | Mitra and Saha, 1970 | N2 |
Packed | Squalane | 80. | 694. | Mitra and Saha, 1970 | N2 |
Capillary | Squalane | 40. | 689. | Matukuma, 1969 | N2; Column length: 91.4 m; Column diameter: 0.25 mm |
Packed | Apiezon L | 100. | 689. | Brown, Chapman, et al., 1968 | N2, DCMS-treated Chromosorb W; Column length: 2.3 m |
Packed | Squalane | 27. | 688. | Hively and Hinton, 1968 | He, Chromosorb P; Column length: 15. m; Column diameter: 0.25 mm |
Packed | Squalane | 49. | 690. | Hively and Hinton, 1968 | He, Chromosorb P; Column length: 15. m; Column diameter: 0.25 mm |
Packed | Squalane | 67. | 692. | Hively and Hinton, 1968 | He, Chromosorb P; Column length: 15. m; Column diameter: 0.25 mm |
Packed | Squalane | 86. | 694. | Hively and Hinton, 1968 | He, Chromosorb P; Column length: 15. m; Column diameter: 0.25 mm |
Packed | Squalane | 30. | 688. | Tourres, 1967 | H2; Column length: 10. m |
Packed | Squalane | 50. | 690. | Tourres, 1967 | H2; Column length: 10. m |
Capillary | Squalane | 30. | 688. | Tourres, 1967, 2 | H2; Column length: 100. m; Column diameter: 0.25 mm |
Capillary | Squalane | 50. | 690. | Tourres, 1967, 2 | H2; Column length: 100. m; Column diameter: 0.25 mm |
Capillary | Squalane | 70. | 692. | Tourres, 1967, 2 | H2; Column length: 100. m; Column diameter: 0.25 mm |
Packed | Squalane | 100. | 696. | Evans, 1966 | Untreated celite; Column length: 1.8 m |
Packed | Squalane | 22. | 687. | Evans, 1966 | Untreated celite; Column length: 1.8 m |
Packed | Squalane | 30. | 689. | Evans, 1966 | Untreated celite; Column length: 1.8 m |
Packed | Squalane | 40. | 689. | Evans, 1966 | Untreated celite; Column length: 1.8 m |
Packed | Squalane | 55. | 692. | Evans, 1966 | Untreated celite; Column length: 1.8 m |
Packed | Squalane | 60. | 691. | Evans, 1966 | Untreated celite; Column length: 1.8 m |
Packed | Squalane | 70. | 693. | Evans, 1966 | Untreated celite; Column length: 1.8 m |
Packed | Squalane | 80. | 694. | Evans, 1966 | Untreated celite; Column length: 1.8 m |
Packed | Squalane | 26. | 687. | Zulaïca and Guiochon, 1966 | Column length: 10. m |
Packed | Apiezon L | 130. | 694. | Wehrli and Kováts, 1959 | Celite; Column length: 2.25 m |
Packed | Apiezon L | 70. | 690. | Wehrli and Kováts, 1959 | Celite; Column length: 2.25 m |

Kovats' RI, non-polar column, temperature ramp

Column type | Active phase | I | Reference | Comment |
---|---|---|---|---|
Capillary | SE-54 | 680. | Rembold, Wallner, et al., 1989 | 30. m/0.25 mm/0.25 μm, He, 0. C @ 12. min, 12. K/min; Tend: 250. C |
Capillary | OV-101 | 686. | Hayes and Pitzer, 1982 | 110. m/0.25 mm/0.20 μm, He, 1. K/min; Tstart: 35. C; Tend: 200. C |
Capillary | Apiezon L | 685. | Louis, 1971 | N2, 1. K/min; Column length: 50. m; Column diameter: 0.25 mm; Tstart: 60. C |

Kovats' RI, non-polar column, custom temperature program

Column type | Active phase | I | Reference | Comment |
---|---|---|---|---|
Capillary | Petrocol DH-100 | 688.44 | Haagen-Smit Laboratory, 1997 | He; Column length: 100. m; Column diameter: 0.2 mm; Program: 5C(10min) => 5C/min => 50C(48min) => 1.5C/min => 195C(91min) |
Capillary | DB-1 | 689. | Hoekman, 1993 | 60. m/0.32 mm/1.0 μm, He; Program: -40 C for 12 min; -40 - 125 C at 3 deg.min; 125-185 C at 6 deg/min; 185 - 220 C at 20 deg/min; hold 220 C for 2 min |

Kovats' RI, polar column, isothermal

Column type | Active phase | Temperature (C) | I | Reference | Comment |
---|---|---|---|---|---|
Packed | Carbowax 20M | 75. | 676. | Goebel, 1982 | N2, Kieselgur (60-100 mesh); Column length: 2. m |

Van Den Dool and Kratz RI, non-polar column, temperature ramp

Column type | Active phase | I | Reference | Comment |
---|---|---|---|---|
Capillary | SPB-5 | 687. | Engel and Ratel, 2007 | 60. m/0.32 mm/1. μm, 40. C @ 2. min, 3. K/min, 230. C @ 10. min |
Capillary | Petrocol DH | 687.5 | Censullo, Jones, et al., 2003 | 50. m/0.25 mm/0.5 μm, He, 35. C @ 10. min, 3. K/min, 200. C @ 10. min |
Capillary | SPB-1 | 683.91 | LECO Corporation, 2003 | 30. m/0.25 mm/0.25 μm, 40. C @ 2. min, 10. K/min, 250. C @ 2. min |
Capillary | OV-101 | 688.0 | Yin, Liu, et al., 2001 | N2, 1. K/min; Column length: 80. m; Column diameter: 0.22 mm; Tstart: 30. C; Tend: 130. C |
Capillary | Ultra-1 | 687. | Olson, Sinkevitch, et al., 1992 | 4. K/min; Tstart: -40. C; Tend: 230. C |
Capillary | Petrocol DH | 686. | White, Hackett, et al., 1992 | 100. m/0.25 mm/0.5 μm, He, 1. K/min; Tstart: 30. C; Tend: 220. C |
Capillary | OV-101 | 686. | Hayes and Pitzer, 1981 | 108. m/0.25 mm/0.2 μm, 1. K/min; Tstart: 35. C; Tend: 200. C |

Van Den Dool and Kratz RI, non-polar column, custom temperature program

Column type | Active phase | I | Reference | Comment |
---|---|---|---|---|
Capillary | Methyl Silicone | 684.80 | Hassoun, Pilling, et al., 1999 | 50. m/0.25 mm/1. μm, He; Program: -50C(2min) => 49.9C/min => 35C(10min) => 3C/min => 200C(2min) => 40C/min => 240C(30min) |
Capillary | HP-PONA | 691. | Maignial, Pibarot, et al., 1992 | 50. m/0.2 mm/0.5 μm; Program: 20C(0.5min) => fast => 60C => 4C/min => 250C |
Capillary | OV-101 | 688. | Wu and Lu, 1984 | Program: not specified |

Van Den Dool and Kratz RI, polar column, custom temperature program

Column type | Active phase | I | Reference | Comment |
---|---|---|---|---|
Capillary | Supelcowax-10 | 698. | Maignial, Pibarot, et al., 1992 | 60. m/0.25 mm/0.25 μm; Program: 20C(0.5min) => fast => 60C => 4C/min => 220C |

Normal alkane RI, non-polar column, isothermal

Column type | Active phase | Temperature (C) | I | Reference | Comment |
---|---|---|---|---|---|
Capillary | Methyl Silicone | 50. | 690. | N/A | N2; Column length: 74.6 m; Column diameter: 0.28 mm |
Capillary | Squalane | 100. | 695. | Dimov N., 1976 | |
Capillary | Squalane | 70. | 692. | Dimov N., 1976 | |
Capillary | Squalane | 86. | 693. | Vigdergauz and Martynov, 1971 | He; Column length: 150. m; Column diameter: 0.35 mm |

Normal alkane RI, non-polar column, temperature ramp

Column type | Active phase | I | Reference | Comment |
---|---|---|---|---|
Capillary | Polydimethyl siloxane: CP-Sil 5 CB | 689. | Bramston-Cook, 2013 | 60. m/0.25 mm/1.0 μm, Helium, 45. C @ 1.45 min, 3.6 K/min, 210. C @ 2.72 min |
Capillary | Petrocol DH | 689. | Supelco, 2012 | 100. m/0.25 mm/0.50 μm, Helium, 20. C @ 15. min, 15. K/min, 220. C @ 30. min |
Capillary | HP-5 MS | 691. | Zenkevich, Makarov A.A., et al., 2009 | 30. m/0.25 mm/0.25 μm, Helium, 2. K/min, 220. C @ 10. min; Tstart: 50. C |
Capillary | BP-1 | 691. | Health Safety Executive, 2000 | 50. m/0.22 mm/0.75 μm, He, 5. K/min; Tstart: 50. C; Tend: 200. C |
Capillary | Methyl Silicone | 684.38 | Baraldi, Rapparini, et al., 1999 | 60. m/0.25 mm/0.25 μm, 40. C @ 10. min, 5. K/min; Tend: 220. C |
Capillary | OV-101 | 689. | Orav, Kailas, et al., 1999 | 50. m/0.20 mm/0.50 μm, Helium, 30. C @ 6. min, 1. K/min; Tend: 100. C |
Capillary | DB-1 | 689. | Ciccioli, Cecinato, et al., 1992 | 60. m/0.32 mm/1.2 μm, He, 30. C @ 10. min, 3. K/min; Tend: 240. C |
Capillary | OV-101 | 689. | Zenkevich and Ventura, 1991 | Helium, 50. C @ 0. min, 5. K/min, 240. C @ 0. min; Column length: 54. m; Column diameter: 0.26 mm |
Capillary | SF-96 | 690. | Donetzhuber, Johansson, et al., 1976 | Nitrogen, 3. K/min, 130. C @ 40. min; Column length: 111. m; Column diameter: 0.76 mm; Initial hold: 8. min |

Normal alkane RI, non-polar column, custom temperature program

Column type | Active phase | I | Reference | Comment |
---|---|---|---|---|
Capillary | Methyl Silicone | 694. | Chen and Feng, 2007 | Program: not specified |
Capillary | Methyl Silicone | 690. | Feng and Mu, 2007 | Program: not specified |
Capillary | Methyl Silicone | 691. | Blunden, Aneja, et al., 2005 | 60. m/0.32 mm/1.0 μm, Helium; Program: -50 0C (2 min) 8 0C/min -> 200 0C (7.75 min) 25 0C -> 225 0C (8 min) |
Capillary | OV-101 | 692. | Du and Liang, 2003 | Program: not specified |
Capillary | Polydimethyl siloxane | 691. | Junkes, Castanho, et al., 2003 | Program: not specified |
Capillary | Polydimethyl siloxanes | 688. | Yin, Guo, et al., 2001 | Program: not specified |
Capillary | Methyl Silicone | 688. | Spieksma, 1999 | Program: not specified |
Capillary | SPB-1 | 692. | Flanagan, Streete, et al., 1997 | 60. m/0.53 mm/5. μm, He; Program: 40C(6min) => 5C/min => 80C => 10C/min => 200C |
Capillary | DB-1 | 685. | Ciccioli, Cecinato, et al., 1994 | 60. m/0.32 mm/0.25 μm; Program: not specified |
Capillary | DB-1 | 685. | Ciccioli, Brancaleoni, et al., 1993 | 60. m/0.32 mm/0.25 μm; Program: 3 min at 5 C; 5 - 50 C at 3 deg/min; 50 - 220 C at 5 deg/min |
Capillary | SPB-1 | 692. | Strete, Ruprah, et al., 1992 | 60. m/0.53 mm/5.0 μm, Helium; Program: 40 0C (6 min) 5 0C/min -> 80 0C 10 0C/min -> 200 0C |
Capillary | OV-1, SE-30, Methyl silicone, SP-2100, OV-101, DB-1, etc. | 686. | Waggott and Davies, 1984 | Hydrogen; Column length: 50. m; Column diameter: 0.32 mm; Program: not specified |
Packed | SE-30 | 700. | Robinson and Odell, 1971 | N2, Chromosorb W; Column length: 6.1 m; Program: 50C910min) => 20C/min => 90(6min) => 10C/min => 150C(hold) |
Packed | SE-30 | 700. | Robinson and Odell, 1971, 2 | Chrom W; Column length: 6.1 m; Program: 50C(10min) => 20C/min(2min) => 90C(6min) => 10C/min(6min) => (hold at 150C) |

Normal alkane RI, polar column, custom temperature program

Column type | Active phase | I | Reference | Comment |
---|---|---|---|---|
Capillary | DB-Wax | 711. | Peng, Yang, et al., 1991 | Program: not specified |
Capillary | Carbowax 20M | 705. | Ramsey and Flanagan, 1982 | Program: not specified |

Henry's Law data

Data compiled by: Rolf Sander
Henry's Law constant (water solution)
kH(T) = k°H exp(d(ln(kH))/d(1/T) ((1/T) - 1/(298.15 K)))
k°H = Henry's law constant for solubility in water at 298.15 K (mol/(kg*bar))
d(ln(kH))/d(1/T) = Temperature dependence constant (K)
k°H (mol/(kg*bar)) | d(ln(kH))/d(1/T) (K) | Method | Reference | Comment |
---|---|---|---|---|
0.00030 | Q | N/A | missing citation give several references for the Henry's law constants but don't assign them to specific species. | |
0.00031 | L | N/A | ||
0.00033 | V | N/A |

References

Prosen and Rossini, 1945
Prosen, E.J.; Rossini, F.D.,
Heats of combustion and formation of the paraffin hydrocarbons at 25° C,
J. Res. NBS, 1945, 263-267. [all data]
Scott D.W., 1974
Scott D.W.,
Chemical Thermodynamic Properties of Hydrocarbons and Related Substances. Properties of the Alkane Hydrocarbons, C1 through C10 in the Ideal Gas State from 0 to 1500 K. U.S. Bureau of Mines, Bulletin 666, 1974. [all data]
Scott D.W., 1974, 2
Scott D.W.,
Correlation of the chemical thermodynamic properties of alkane hydrocarbons,
J. Chem. Phys., 1974, 60, 3144-3165. [all data]
Pitzer K.S., 1940
Pitzer K.S.,
The thermodynamics of n-heptane and 2,2,4-trimethylpentane, including heat capacities, heats of fusion and vaporization and entropies,
J. Am. Chem. Soc., 1940, 62, 1224-1227. [all data]
Parks, Huffman, et al., 1930
Parks, G.S.; Huffman, H.M.; Thomas, S.B.,
Thermal data on organic compounds. VI. The heat capacities, entropies and free energies of some saturated, non-benzenoid hydrocarbons,
J. Am. Chem. Soc., 1930, 52, 1032-1041. [all data]
Costas, Huu, et al., 1988
Costas, M.; Huu, V.T.; Patterson, D.; Caceres-Alonso, M.; Tardajos, G.; Aicart, E.,
Liquid structure and second-order mixing functions for l-chloronaphthalene with linear and branched alkanes, J. Chem. Soc.,
Faraday Trans., 1988, 1 84(5), 1603-1616. [all data]
Perez-Casas, Aicart, et al., 1988
Perez-Casas, S.; Aicart, E.; Trojo, L.M.; Costas, M.,
Excess heat capacity. Chlorobenzene-2,2,4,4,6,8,8-heptamethylnonane, Int. Data Ser.,
Sel. Data Mixtures, 1988, (2)A, 123. [all data]
Shiohama, Ogawa, et al., 1988
Shiohama, Y.; Ogawa, H.; Murakami, S.; Fujihara, I.,
Excess molar isobaric heat capacities and isentropic compressibilities of (cis- or trans-decalin + benzene or toluene or iso-octane or n-heptane) at 298.15 K,
J. Chem. Thermodynam., 1988, 20, 1183-1189. [all data]
Kalali, Kohler, et al., 1987
Kalali, H.; Kohler, F.; Svejda, P.,
Excess properties of the mixture bis(2-dichlorethyl)ether (chlorex) + 2,2,4-trimethylpentane (isooctane),
Monatsh. Chem., 1987, 118, 1-18. [all data]
Fortier and Benson, 1976
Fortier, J.-L.; Benson, G.C.,
Excess heat capacities of binary liquid mixtures determined with a Picker flow calorimeter,
J. Chem. Thermodynam., 1976, 8, 411-423. [all data]
Rajagopal and Subrahmanyam, 1974
Rajagopal, E.; Subrahmanyam, S.V.,
Excess function of VE,(dVE/dp)T, and CpE of isooctane + benzene and + toluene,
J. Chem. Thermodynam., 1974, 6, 873-876. [all data]
Subrahmanyam and Rajagopal, 1973
Subrahmanyam, S.V.; Rajagopal, E.,
Excess thermodynamic functions of the systems isooctane + carbon tetrachloride and isooctane + cyclohexane,
Z. Phys. Chem. [NF], 1973, 85, 256-268. [all data]
Auerbach, Sage, et al., 1950
Auerbach, C.E.; Sage, B.H.; Lacey, W.N.,
Isobaric heat capacities at bubble point,
Ind. Eng. Chem., 1950, 42, 110-113. [all data]
Osborne and Ginnings, 1947
Osborne, N.S.; Ginnings, D.C.,
Measurements of heat of vaporization and heat capacity of a number of hydrocarbons,
J. Res. NBS, 1947, 39, 453-477. [all data]
Streiff, 1959
Streiff, A.J.,
Unpublished 1959, 1959. [all data]
Parks, Huffman, et al., 1930, 2
Parks, G.S.; Huffman, H.M.; Thomas, S.B.,
Thermal Data on Organic Compounds VI. The Heat Capacities, Entropies and Free Energies of Some Saturated, Non-Benzenoid Hydrocarbons,
J. Am. Chem. Soc., 1930, 52, 1032-41. [all data]
Daubert, 1996
Daubert, T.E.,
Vapor-Liquid Critical Properties of Elements and Compounds. 5. Branched Alkanes and Cycloalkanes,
J. Chem. Eng. Data, 1996, 41, 365-372. [all data]
McMicking and Kay, 1965
McMicking, J.H.; Kay, W.B.,
Vapor Pressures and Saturated Liquid and Vapor Densities of The Isomeric Heptanes and Isomeric Octanes,
Proc., Am. Pet. Inst., Sect. 3, 1965, 45, 75-90. [all data]
Kay and Warzel, 1951
Kay, W.B.; Warzel, F.M.,
2,2,4-Trimethylpentane (Isooctane), Vapor Pressure, Critical Constants and Saturated Vapor and Liquid Densities,
Ind. Eng. Chem., 1951, 43, 1150-2. [all data]
Beattie and Edwards, 1948
Beattie, J.A.; Edwards, D.G.,
The Vapor Pressure, Orthobaric Densities, and Critical Constants of 2,2,4-Trimethylpentane,
J. Am. Chem. Soc., 1948, 70, 3382. [all data]
Majer and Svoboda, 1985
Majer, V.; Svoboda, V.,
Enthalpies of Vaporization of Organic Compounds: A Critical Review and Data Compilation, Blackwell Scientific Publications, Oxford, 1985, 300. [all data]
Wu, Pividal, et al., 1991
Wu, Huey S.; Pividal, Katherine A.; Sandler, Stanley I.,
Vapor-liquid equilibria of hydrocarbons and fuel oxygenates,
J. Chem. Eng. Data, 1991, 36, 4, 418-421, https://doi.org/10.1021/je00004a021
. [all data]
Stephenson and Malanowski, 1987
Stephenson, Richard M.; Malanowski, Stanislaw,
Handbook of the Thermodynamics of Organic Compounds, 1987, https://doi.org/10.1007/978-94-009-3173-2
. [all data]
Milazzo, 1956
Milazzo, G.,
Ann. Chim. (Rome), 1956, 46, 1105. [all data]
Willingham, Taylor, et al., 1945
Willingham, C.B.; Taylor, W.J.; Pignocco, J.M.; Rossini, F.D.,
Vapor pressures and boiling points of some paraffin, alkylcyclopentane, alkylcyclohexane, and alkylbenzene hydrocarbons,
J. RES. NATL. BUR. STAN., 1945, 35, 3, 219-17, https://doi.org/10.6028/jres.035.009
. [all data]
Svoboda, Charvátová, et al., 1982
Svoboda, Václav; Charvátová, Vladimíra; Majer, Vladimír; Hynek, Vladimír,
Determination of heats of vaporization and some other thermodynamic properties for four substituted hydrocarbons,
Collect. Czech. Chem. Commun., 1982, 47, 2, 543-549, https://doi.org/10.1135/cccc19820543
. [all data]
Majer, Svoboda, et al., 1979
Majer, Vladimír; Svoboda, Václav; Hála, Slavoj; Pick, Jirí,
Temperature dependence of heats of vaporization of saturated hydrocarbons C5-C8; Experimental data and an estimation method,
Collect. Czech. Chem. Commun., 1979, 44, 3, 637-651, https://doi.org/10.1135/cccc19790637
. [all data]
Smith, 1940
Smith, E.R.,
Boiling points of n-heptane and 2,2,4-trimethylpentane over the range 100- to 1,500-millimeter pressure,
J. RES. NATL. BUR. STAN., 1940, 24, 3, 229-17, https://doi.org/10.6028/jres.024.010
. [all data]
Milazzo, 1956, 2
Milazzo, G.,
Tensioni di Vapore di Alcune Sostanze Organiche a Bassa Temperatura,
Ann. Chim. (Rome), 1956, 46, 1105-1111. [all data]
Williamham, Taylor, et al., 1945
Williamham, C.B.; Taylor, W.J.; Pignocco, J.M.; Rossini, F.D.,
Vapor Pressures and Boiling Points of Some Paraffin, Alkylcyclopentane, Alkylcyclohexane, and Alkylbenzene Hydrocarbons,
J. Res. Natl. Bur. Stand. (U.S.), 1945, 35, 3, 219-244, https://doi.org/10.6028/jres.035.009
. [all data]
Domalski and Hearing, 1996
Domalski, Eugene S.; Hearing, Elizabeth D.,
Heat Capacities and Entropies of Organic Compounds in the Condensed Phase. Volume III,
J. Phys. Chem. Ref. Data, 1996, 25, 1, 1, https://doi.org/10.1063/1.555985
. [all data]
Turner, Nettleton, et al., 1958
Turner, R.B.; Nettleton, J.E.; Perelman,
Heats of Hydrogenation. VI. Heats of hydrogenation of some substituted ethylenes,
J. Am. Chem. Soc., 1958, 80, 1430-1433. [all data]
Dolliver, Gresham, et al., 1937
Dolliver, M.a.; Gresham, T.L.; Kistiakowsky, G.B.; Vaughan, W.E.,
Heats of organic reactions. V. Heats of hydrogenation of various hydrocarbons,
J. Am. Chem. Soc., 1937, 59, 831-841. [all data]
Cox and Pilcher, 1970
Cox, J.D.; Pilcher, G.,
Thermochemistry of Organic and Organometallic Compounds, Academic Press, New York, 1970, 1-636. [all data]
Crawford and Parks, 1936
Crawford, B.L., Jr.; Parks, G.S.,
The heat of hydrogenation of diisobutylene,
J. Am. Chem. Soc., 1936, 58, 373. [all data]
Prosen and Rossini, 1945, 2
Prosen, E.J.; Rossini, F.D.,
Heats of isomerization of the 18 octanes,
J. Res. NBS, 1945, 34, 163-174. [all data]
Al-Joboury and Turner, 1964
Al-Joboury, M.I.; Turner, D.W.,
Molecular photoelectron spectroscopy. Part II. A summary of ionization potentials,
J. Chem. Soc., 1964, 4434. [all data]
Watanabe, Nakayama, et al., 1962
Watanabe, K.; Nakayama, T.; Mottl, J.,
Ionization potentials of some molecules,
J. Quant. Spectry. Radiative Transfer, 1962, 2, 369. [all data]