1,2-Ethanedithiol
- Formula: C2H6S2
- Molecular weight: 94.199
- IUPAC Standard InChIKey: VYMPLPIFKRHAAC-UHFFFAOYSA-N
- CAS Registry Number: 540-63-6
- Chemical structure:
View 3d structure (requires JavaScript / HTML 5) - Other names: s-Ethylene dimercaptan; Dithioethyleneglycol; Dithioglycol; Ethylene dithioglycol; Ethylene glycol, dithio-; Ethylenedimercaptan; Ethylenedithiol; 1,2-Dimercaptoethane; 1,2-Ethanethiol; Ethane-1,2-dithiol; 1,2-Dithiolethane; NSC 60481

Gas phase thermochemistry data

Data compiled by: Hussein Y. Afeefy, Joel F. Liebman, and Stephen E. Stein
Quantity | Value | Units | Method | Reference | Comment |
---|---|---|---|---|---|
ΔfH°gas | -9.3 ± 1.1 | kJ/mol | Ccb | Mansson and Sunner, 1962 | hf298_H2SO4.115=-212.24 kcal/mol |

Condensed phase thermochemistry data

Data compiled by: Hussein Y. Afeefy, Joel F. Liebman, and Stephen E. Stein
Quantity | Value | Units | Method | Reference | Comment |
---|---|---|---|---|---|
ΔfH°liquid | -54.0 ± 1.1 | kJ/mol | Ccb | Mansson and Sunner, 1962 | hf298_H2SO4.115=-212.24 kcal/mol |
Quantity | Value | Units | Method | Reference | Comment |
ΔcH°liquid | -2794.9 ± 0.92 | kJ/mol | Ccb | Mansson and Sunner, 1962 | hf298_H2SO4.115=-212.24 kcal/mol |

Phase change data

Data compiled as indicated in comments:
BS - Robert L. Brown and Stephen E. Stein
TRC - Thermodynamics Research Center, NIST Boulder Laboratories, Chris Muzny director
ALS - Hussein Y. Afeefy, Joel F. Liebman, and Stephen E. Stein
DRB - Donald R. Burgess, Jr.
AC - William E. Acree, Jr., James S. Chickos
Quantity | Value | Units | Method | Reference | Comment |
---|---|---|---|---|---|
Tboil | 419.2 | K | N/A | Weast and Grasselli, 1989 | BS |
Tboil | 419.2 | K | N/A | Majer and Svoboda, 1985 | |
Tboil | 418. | K | N/A | Zinner, 1953 | Uncertainty assigned by TRC = 4. K; TRC |
Quantity | Value | Units | Method | Reference | Comment |
ΔvapH° | 44.69 | kJ/mol | N/A | Majer and Svoboda, 1985 | |
ΔvapH° | 44.7 ± 0.1 | kJ/mol | V | Mansson and Sunner, 1962 | hf298_H2SO4.115=-212.24 kcal/mol; ALS |
ΔvapH° | 44.7 | kJ/mol | N/A | Mansson and Sunner, 1962 | DRB |
ΔvapH° | 44.7 | kJ/mol | N/A | Mansson and Sunner, 1962 | AC |
Enthalpy of vaporization
ΔvapH (kJ/mol) | Temperature (K) | Reference |
---|---|---|
37.93 | 419.2 | Majer and Svoboda, 1985 |

Gas phase ion energetics data

Data compiled as indicated in comments:
LBLHLM - Sharon G. Lias, John E. Bartmess, Joel F. Liebman, John L. Holmes, Rhoda D. Levin, and W. Gary Mallard
LLK - Sharon G. Lias, Rhoda D. Levin, and Sherif A. Kafafi
Ionization energy determinations
IE (eV) | Method | Reference | Comment |
---|---|---|---|
9.3 | PI | Butler, Baer, et al., 1983 | LBLHLM |
9.0 | PE | Kimura, Katsumata, et al., 1981 | LLK |
9.35 | PE | Kimura, Katsumata, et al., 1981 | Vertical value; LLK |
Appearance energy determinations
Ion | AE (eV) | Other Products | Method | Reference | Comment |
---|---|---|---|---|---|
C2H5S+ | 10.4 ± 0.15 | SH | EI | Broer, Weringa, et al., 1979 | LLK |

Van Den Dool and Kratz RI, polar column, custom temperature program

Data compiled by: NIST Mass Spectrometry Data Center, William E. Wallace, director

Column type Capillary
Active phase FFAP
Column length (m) 30.
Carrier gas He
Substrate
Column diameter (mm) 0.32
Phase thickness (μm) 0.25
Program 40C (2min) => 40C/min => 60C (1min) => 6C/min => 230C (15min)
I 1330.
ReferenceEngel and Schieberle, 2002
Comment MSDC-RI

Van Den Dool and Kratz RI, non-polar column, custom temperature program

Data compiled by: NIST Mass Spectrometry Data Center, William E. Wallace, director

Column type Capillary
Active phase DB-5
Column length (m) 30.
Carrier gas He
Substrate
Column diameter (mm) 0.32
Phase thickness (μm) 0.25
Program 40C (2min) => 40C/min => 60C (1min) => 6C/min => 230C (15min)
I 815.
ReferenceEngel and Schieberle, 2002
Comment MSDC-RI

Kovats' RI, polar column, custom temperature program

Data compiled by: NIST Mass Spectrometry Data Center, William E. Wallace, director

Column type Capillary
Active phase PEG-20M
Column length (m)
Carrier gas
Substrate
Column diameter (mm)
Phase thickness (μm)
Program not specified
I 1348.
ReferenceZhu, Wang, et al., 2007
Comment MSDC-RI

Normal alkane RI, non-polar column, temperature ramp

Data compiled by: NIST Mass Spectrometry Data Center, William E. Wallace, director

Column type Capillary
Active phase OV-101
Column length (m) 25.
Carrier gas N2/He
Substrate
Column diameter (mm) 0.20
Phase thickness (μm) 0.10
Tstart (C) 50.
Tend (C) 250.
Heat rate (K/min) 6.
Initial hold (min)
Final hold (min)
I 805.
ReferenceZenkevich, 2005
Comment MSDC-RI

References

Mansson and Sunner, 1962
Mansson, M.; Sunner, S.,
Heats of combustion and formation of the n-Alkane-αω-dithiols from ethane through pentane,
Acta Chem. Scand., 1962, 16, 1863-1869. [all data]
Weast and Grasselli, 1989
CRC Handbook of Data on Organic Compounds, 2nd Editon, Weast,R.C and Grasselli, J.G., ed(s)., CRC Press, Inc., Boca Raton, FL, 1989, 1. [all data]
Majer and Svoboda, 1985
Majer, V.; Svoboda, V.,
Enthalpies of Vaporization of Organic Compounds: A Critical Review and Data Compilation, Blackwell Scientific Publications, Oxford, 1985, 300. [all data]
Zinner, 1953
Zinner, H.,
Perparation of Mercaptans,
Chem. Ber., 1953, 86, 825. [all data]
Butler, Baer, et al., 1983
Butler, J.J.; Baer, T.; Evans, S.A., Jr.,
Energetics and structures of organosulfur ions: CH3SSCH3+, CH3SS+, C2H5S+, and CH2SH+,
J. Am. Chem. Soc., 1983, 105, 3451. [all data]
Kimura, Katsumata, et al., 1981
Kimura, K.; Katsumata, S.; Achiba, Y.; Yamazaki, T.; Iwata, S.,
Ionization energies, Ab initio assignments, and valence electronic structure for 200 molecules
in Handbook of HeI Photoelectron Spectra of Fundamental Organic Compounds, Japan Scientific Soc. Press, Tokyo, 1981. [all data]
Broer, Weringa, et al., 1979
Broer, W.J.; Weringa, W.D.; Nieuwpoort, W.C.,
Rearrangements and fragmentations of [C2H5S]+ ions,
Org. Mass Spectrom., 1979, 14, 543. [all data]