Propanoic acid, 2-methylpropyl ester
- Formula: C7H14O2
- Molecular weight: 130.1849
- IUPAC Standard InChIKey: FZXRXKLUIMKDEL-UHFFFAOYSA-N
- CAS Registry Number: 540-42-1
- Chemical structure:
View 3d structure (requires JavaScript / HTML 5) - Other names: Propionic acid, isobutyl ester; Isobutyl propionate; 2-Methylpropyl propionate; Isobutyl propanoate; UN 2394; Isobutyl ester of propanoic acid; iso-Butyl n-propionate; 2-Methylpropyl propanoate

Phase change data

Data compiled as indicated in comments:
BS - Robert L. Brown and Stephen E. Stein
TRC - Thermodynamics Research Center, NIST Boulder Laboratories, Chris Muzny director
AC - William E. Acree, Jr., James S. Chickos
Quantity | Value | Units | Method | Reference | Comment |
---|---|---|---|---|---|
Tboil | 410. ± 2. | K | AVG | N/A | Average of 6 values; Individual data points |
Quantity | Value | Units | Method | Reference | Comment |
Tfus | 201.8 | K | N/A | Timmermans, 1922 | Uncertainty assigned by TRC = 0.4 K; TRC |
Quantity | Value | Units | Method | Reference | Comment |
Tc | 583.8 | K | N/A | Young, 1994 | Uncertainty assigned by TRC = 1. K; TRC |
Tc | 591.9 | K | N/A | Pawlewski, 1882 | Uncertainty assigned by TRC = 6. K; TRC |
Reduced pressure boiling point
Tboil (K) | Pressure (bar) | Reference | Comment |
---|---|---|---|
339.7 | 0.080 | Weast and Grasselli, 1989 | BS |
Enthalpy of vaporization
ΔvapH (kJ/mol) | Temperature (K) | Method | Reference | Comment |
---|---|---|---|---|
44.9 | 286. | A | Stephenson and Malanowski, 1987 | Based on data from 271. to 410. K. See also Stull, 1947.; AC |
Antoine Equation Parameters
log10(P) = A − (B / (T + C))
P = vapor pressure (bar)
T = temperature (K)
View plot Requires a JavaScript / HTML 5 canvas capable browser.
Temperature (K) | A | B | C | Reference | Comment |
---|---|---|---|---|---|
270.9 to 410.0 | 4.78284 | 1767.952 | -39.953 | Stull, 1947 | Coefficents calculated by NIST from author's data. |

Gas phase ion energetics data

Data compiled by: Sharon G. Lias, Rhoda D. Levin, and Sherif A. Kafafi
Ionization energy determinations
IE (eV) | Method | Reference | Comment |
---|---|---|---|
9.94 | PE | Benoit and Harrison, 1977 | Vertical value |

Normal alkane RI, non-polar column, temperature ramp

Data compiled by: NIST Mass Spectrometry Data Center, William E. Wallace, director

Column type CapillaryCapillaryCapillaryCapillary
Active phase ZB-1DB-1ZB-1HP-5
Column length (m) 30.30.30.
Carrier gas NitrogenHeN2
Substrate
Column diameter (mm) 0.25 0.25
Phase thickness (μm) 0.250.250.25
Tstart (C) 45.50.45.35.
Tend (C) 230.220.230.200.
Heat rate (K/min) 3.6.3.6.
Initial hold (min)  2. 2.
Final hold (min)  20.
I 873.850.873.868.
ReferenceMierendorff, Stahl-Biskup, et al., 2008Audino, Alzogaray, et al., 2007Mierendorff, Stahl-Biskup, et al., 2003Larsen and Frisvad, 1995
Comment MSDC-RI MSDC-RI MSDC-RI MSDC-RI

Kovats' RI, polar column, isothermal

Data compiled by: NIST Mass Spectrometry Data Center, William E. Wallace, director

Column type CapillaryPackedPacked
Active phase SP-1000Carbowax 20MCarbowax 20M
Column length (m) 46.3.2.
Carrier gas N2
Substrate  Chromosorb WAW (60-80 mesh)Chromosorb W
Column diameter (mm) 0.23
Phase thickness (μm)
Temperature (C) 100.100.100.
I 1079.1079.1090.
ReferenceHorna, Táborský, et al., 1985Chastrette, Heintz, et al., 1974Zarazir, Chovin, et al., 1970
Comment MSDC-RI MSDC-RI MSDC-RI

Normal alkane RI, polar column, temperature ramp

Data compiled by: NIST Mass Spectrometry Data Center, William E. Wallace, director

Column type CapillaryCapillary
Active phase CP-Wax 52CBDB-Wax
Column length (m) 30.60.
Carrier gas HeHe
Substrate
Column diameter (mm)  0.25
Phase thickness (μm) 0.320.25
Tstart (C) 50.40.
Tend (C) 220.220.
Heat rate (K/min) 6.3.
Initial hold (min) 2.10.
Final hold (min) 20.10.
I 1071.1079.
ReferenceAudino, Alzogaray, et al., 2007Hayata, Sakamoto, et al., 2002
Comment MSDC-RI MSDC-RI

References

Timmermans, 1922
Timmermans, J.,
Investigation of the Freezing Point of Organic Substances VII,
Bull. Soc. Chim. Belg., 1922, 31, 389. [all data]
Young, 1994
Young, C.L.,
Personal Commun. 1994 1994, 1994. [all data]
Pawlewski, 1882
Pawlewski, B.,
The critical temperatures of ester compounds,
Ber. Dtsch. Chem. Ges., 1882, 15, 2460-4. [all data]
Weast and Grasselli, 1989
CRC Handbook of Data on Organic Compounds, 2nd Editon, Weast,R.C and Grasselli, J.G., ed(s)., CRC Press, Inc., Boca Raton, FL, 1989, 1. [all data]
Stephenson and Malanowski, 1987
Stephenson, Richard M.; Malanowski, Stanislaw,
Handbook of the Thermodynamics of Organic Compounds, 1987, https://doi.org/10.1007/978-94-009-3173-2
. [all data]
Stull, 1947
Stull, Daniel R.,
Vapor Pressure of Pure Substances. Organic and Inorganic Compounds,
Ind. Eng. Chem., 1947, 39, 4, 517-540, https://doi.org/10.1021/ie50448a022
. [all data]
Benoit and Harrison, 1977
Benoit, F.M.; Harrison, A.G.,
Predictive value of proton affinity. Ionization energy correlations involving oxygenated molecules,
J. Am. Chem. Soc., 1977, 99, 3980. [all data]