Phenol, 4-iodo-
- Formula: C6H5IO
- Molecular weight: 220.0078
- IUPAC Standard InChIKey: VSMDINRNYYEDRN-UHFFFAOYSA-N
- CAS Registry Number: 540-38-5
- Chemical structure:

Condensed phase thermochemistry data

Data compiled by: Hussein Y. Afeefy, Joel F. Liebman, and Stephen E. Stein
Quantity | Value | Units | Method | Reference | Comment |
---|---|---|---|---|---|
ΔcH°solid | -2980.3 ± 4.2 | kJ/mol | Ccb | Smith, 1956 | Reanalyzed by Cox and Pilcher, 1970, Original value = -2979.0 ± 4.2 kJ/mol |

Phase change data

Data compiled by: Robert L. Brown and Stephen E. Stein
Reduced pressure boiling point
Tboil (K) | Pressure (bar) | Reference |
---|---|---|
411.2 | 0.007 | Aldrich Chemical Company Inc., 1990 |

Gas phase ion energetics data

Data compiled by: Sharon G. Lias, Rhoda D. Levin, and Sherif A. Kafafi
Ionization energy determinations
IE (eV) | Method | Reference |
---|---|---|
8.06 | PE | Behan, Johnstone, et al., 1976 |

Kovats' RI, non-polar column, custom temperature program

Column type | Active phase | I | Reference | Comment |
---|---|---|---|---|
Packed | SE-30 | 1398. | Grzybowski, Lamparczyk, et al., 1980 | Chromosorb W HMDS (80-100 mesh); Column length: 2.9 m; Program: not specified |

Van Den Dool and Kratz RI, non-polar column, temperature ramp

Column type | Active phase | I | Reference | Comment |
---|---|---|---|---|
Packed | SE-30 | 1434. | Peng, Ding, et al., 1988 | He, Supelcoport and Chromosorb, 40. C @ 4. min, 10. K/min, 250. C @ 60. min; Column length: 3.05 m |

Normal alkane RI, non-polar column, temperature ramp

Column type | Active phase | I | Reference | Comment |
---|---|---|---|---|
Capillary | TR-1 | 1359. | Gruzdev, Kuzivanov, et al., 2012 | 30. m/0.32 mm/0.25 μm, Helium, 5. K/min; Tstart: 50. C; Tend: 300. C |

Normal alkane RI, non-polar column, custom temperature program

Column type | Active phase | I | Reference | Comment |
---|---|---|---|---|
Capillary | SE-30 | 1398. | Peterson, 1992 | Program: not specified |

References

Smith, 1956
Smith, L.,
Corrected heats of combustion of organic iodine compounds,
Acta Chem. Scand., 1956, 10, 884-886. [all data]
Cox and Pilcher, 1970
Cox, J.D.; Pilcher, G.,
Thermochemistry of Organic and Organometallic Compounds, Academic Press, New York, 1970, 1-636. [all data]
Aldrich Chemical Company Inc., 1990
Aldrich Chemical Company Inc.,
Catalog Handbook of Fine Chemicals, Aldrich Chemical Company, Inc., Milwaukee WI, 1990, 1. [all data]
Behan, Johnstone, et al., 1976
Behan, J.M.; Johnstone, R.A.W.; Bentley, T.W.,
An evaluation of empirical methods for calculating the ionization potentials of substituted benzenes,
Org. Mass Spectrom., 1976, 11, 207. [all data]
Burawoy and Chamberlain, 1952
Burawoy, A.; Chamberlain, J.T.,
J. Chem. Soc., 1952, 2310. [all data]
Grzybowski, Lamparczyk, et al., 1980
Grzybowski, J.; Lamparczyk, H.; Nasal, A.; Radecki, A.,
Relationship between the retention indices of phenols on polar and non-polar stationary phases,
J. Chromatogr., 1980, 196, 2, 217-223, https://doi.org/10.1016/S0021-9673(00)80441-0
. [all data]
Peng, Ding, et al., 1988
Peng, C.T.; Ding, S.F.; Hua, R.L.; Yang, Z.C.,
Prediction of Retention Indexes I. Structure-Retention Index Relationship on Apolar Columns,
J. Chromatogr., 1988, 436, 137-172, https://doi.org/10.1016/S0021-9673(00)94575-8
. [all data]
Gruzdev, Kuzivanov, et al., 2012
Gruzdev, I.V.; Kuzivanov, I.M.; Zenkevich, I.G.; Kondratenok, B.M.,
Gas-chromatographic identification of products formed in iodination of methyl phenols by retention indices,
Rus. J. Appl. Chem., 2012, 85, 9, 1355-1365, https://doi.org/10.1134/S1070427212090108
. [all data]
Peterson, 1992
Peterson, K.L.,
Counter-Propagation Neural Networks in the Modeling and Prediction of Kovats Indices for Substituted Phenols,
Anal. Chem., 1992, 64, 4, 379-386, https://doi.org/10.1021/ac00028a011
. [all data]