Benzene, 1,4-difluoro-
- Formula: C6H4F2
- Molecular weight: 114.0928
- IUPAC Standard InChIKey: QUGUFLJIAFISSW-UHFFFAOYSA-N
- CAS Registry Number: 540-36-3
- Chemical structure:
View 3d structure (requires JavaScript / HTML 5) - Other names: Benzene, p-difluoro-; p-Difluorobenzene; 1,4-Difluorobenzene; para-Difluorobenzene

Gas phase thermochemistry data

Data compiled by: Hussein Y. Afeefy, Joel F. Liebman, and Stephen E. Stein
Quantity | Value | Units | Method | Reference | Comment |
---|---|---|---|---|---|
ΔfH°gas | -306.7 ± 1.0 | kJ/mol | Ccr | Good, Lacina, et al., 1962 | Corrected for CODATA value of ΔfH |

Condensed phase thermochemistry data

Data compiled as indicated in comments:
ALS - Hussein Y. Afeefy, Joel F. Liebman, and Stephen E. Stein
DH - Eugene S. Domalski and Elizabeth D. Hearing
Quantity | Value | Units | Method | Reference | Comment |
---|---|---|---|---|---|
ΔfH°liquid | -342.3 ± 1.0 | kJ/mol | Ccr | Good, Lacina, et al., 1962 | Corrected for CODATA value of ΔfH; ALS |
Quantity | Value | Units | Method | Reference | Comment |
ΔcH°liquid | -2948.4 ± 0.54 | kJ/mol | Ccr | Good, Lacina, et al., 1962 | Corrected for CODATA value of ΔfH; ALS |
ΔcH°liquid | -2954. | kJ/mol | Ccb | Swarts, 1919 | Not corrected for CODATA value of ΔfH; ALS |
Constant pressure heat capacity of liquid
Cp,liquid (J/mol*K) | Temperature (K) | Reference | Comment |
---|---|---|---|
159.1 | 298.15 | Lichanot, 1991 | T = 186 to 324 K. Cp(liq) = 155.192 + 0.158T(°C) J/mol*K (-35 to 51°C). Cp value calculated from equation.; DH |
157.5 | 298.15 | Good, Lacina, et al., 1962 | DH |

Phase change data

Data compiled as indicated in comments:
BS - Robert L. Brown and Stephen E. Stein
TRC - Thermodynamics Research Center, NIST Boulder Laboratories, Chris Muzny director
AC - William E. Acree, Jr., James S. Chickos
ALS - Hussein Y. Afeefy, Joel F. Liebman, and Stephen E. Stein
DH - Eugene S. Domalski and Elizabeth D. Hearing
Quantity | Value | Units | Method | Reference | Comment |
---|---|---|---|---|---|
Tboil | 360. to 361. | K | N/A | PCR Inc., 1990 | BS |
Tboil | 362.2 | K | N/A | Weast and Grasselli, 1989 | BS |
Tboil | 362. | K | N/A | Majer and Svoboda, 1985 | |
Tboil | 362. | K | N/A | Bergmann, Berkovic, et al., 1956 | Uncertainty assigned by TRC = 3. K; TRC |
Quantity | Value | Units | Method | Reference | Comment |
Tfus | 249.6 | K | N/A | Goates, Ott, et al., 1976 | Uncertainty assigned by TRC = 0.08 K; TRC |
Quantity | Value | Units | Method | Reference | Comment |
ΔvapH° | 35.62 | kJ/mol | N/A | Majer and Svoboda, 1985 | |
ΔvapH° | 35.8 | kJ/mol | N/A | Osborn and Scott, 1980 | Based on data from 300. to 400. K. See also Basarová and Svoboda, 1991.; AC |
ΔvapH° | 35.68 | kJ/mol | V | Findlay, 1969 | ALS |
ΔvapH° | 35.6 ± 0.2 | kJ/mol | V | Good, Lacina, et al., 1962 | Corrected for CODATA value of ΔfH; ALS |
Enthalpy of vaporization
ΔvapH (kJ/mol) | Temperature (K) | Reference | Comment |
---|---|---|---|
31.77 | 362. | Majer and Svoboda, 1985 |
Temperature of phase transition
Ttrs (K) | Initial Phase | Final Phase | Reference | Comment |
---|---|---|---|---|
249.45 | crystaline, I | liquid | Lichanot, 1991 | DH |
Enthalpy of phase transition
ΔHtrs (kJ/mol) | Temperature (K) | Initial Phase | Final Phase | Reference | Comment |
---|---|---|---|---|---|
0.00 | 198. | crystaline, II | crystaline, I | Lichanot, 1991 | Allotropic transformation.; DH |

Reaction thermochemistry data

Data compiled as indicated in comments:
B - John E. Bartmess
M - Michael M. Meot-Ner (Mautner) and Sharon G. Lias
RCD - Robert C. Dunbar
Individual Reactions
C6H3F2- + =
By formula: C6H3F2- + H+ = C6H4F2
Quantity | Value | Units | Method | Reference | Comment |
---|---|---|---|---|---|
ΔrH° | 1591. ± 8.8 | kJ/mol | G+TS | Buker, Nibbering, et al., 1997 | gas phase; B |
ΔrH° | 1589. ± 13. | kJ/mol | G+TS | Briscese and Riveros, 1975 | gas phase; < MeOH, <= EtOH; value altered from reference due to change in acidity scale; B |
Quantity | Value | Units | Method | Reference | Comment |
ΔrG° | 1557. ± 8.4 | kJ/mol | IMRE | Buker, Nibbering, et al., 1997 | gas phase; B |
ΔrG° | 1555. ± 13. | kJ/mol | IMRB | Briscese and Riveros, 1975 | gas phase; < MeOH, <= EtOH; value altered from reference due to change in acidity scale; B |
By formula: H4N+ + C6H4F2 = (H4N+ • C6H4F2)
Quantity | Value | Units | Method | Reference | Comment |
---|---|---|---|---|---|
ΔrH° | 54. | kJ/mol | PHPMS | Deakyne and Meot-Ner (Mautner), 1985 | gas phase; Entropy change calculated or estimated; M |
Quantity | Value | Units | Method | Reference | Comment |
ΔrS° | 84. | J/mol*K | N/A | Deakyne and Meot-Ner (Mautner), 1985 | gas phase; Entropy change calculated or estimated; M |
Free energy of reaction
ΔrG° (kJ/mol) | T (K) | Method | Reference | Comment |
---|---|---|---|---|
21. | 395. | PHPMS | Deakyne and Meot-Ner (Mautner), 1985 | gas phase; Entropy change calculated or estimated; M |
By formula: Cl- + C6H4F2 = (Cl- • C6H4F2)
Quantity | Value | Units | Method | Reference | Comment |
---|---|---|---|---|---|
ΔrH° | 57.7 ± 8.4 | kJ/mol | IMRE | Larson and McMahon, 1984 | gas phase; B,M |
Quantity | Value | Units | Method | Reference | Comment |
ΔrS° | 90.4 | J/mol*K | N/A | Larson and McMahon, 1984 | gas phase; switching reaction(Cl-)ClCOOCH3, Entropy change calculated or estimated; Larson and McMahon, 1984, 2; M |
Quantity | Value | Units | Method | Reference | Comment |
ΔrG° | 31. ± 8.4 | kJ/mol | IMRE | Larson and McMahon, 1984 | gas phase; B,M |
By formula: C6H6+ + C6H4F2 = (C6H6+ • C6H4F2)
Bond type: Charge transfer bond (positive ion)
Quantity | Value | Units | Method | Reference | Comment |
---|---|---|---|---|---|
ΔrH° | 47.3 | kJ/mol | MPI | Ernstberger, Krause, et al., 1990 | gas phase; M |
By formula: C6H4F2+ + C6H4F2 = (C6H4F2+ • C6H4F2)
Bond type: Charge transfer bond (positive ion)
Quantity | Value | Units | Method | Reference | Comment |
---|---|---|---|---|---|
ΔrH° | 37. | kJ/mol | MPI | Ernstberger, Krause, et al., 1990 | gas phase; M |
By formula: Cr+ + C6H4F2 = (Cr+ • C6H4F2)
Quantity | Value | Units | Method | Reference | Comment |
---|---|---|---|---|---|
ΔrH° | 121. | kJ/mol | RAK | Ryzhov, 1999 | RCD |

Henry's Law data

Data compiled by: Rolf Sander
Henry's Law constant (water solution)
kH(T) = k°H exp(d(ln(kH))/d(1/T) ((1/T) - 1/(298.15 K)))
k°H = Henry's law constant for solubility in water at 298.15 K (mol/(kg*bar))
d(ln(kH))/d(1/T) = Temperature dependence constant (K)
k°H (mol/(kg*bar)) | d(ln(kH))/d(1/T) (K) | Method | Reference | Comment |
---|---|---|---|---|
0.13 | Q | N/A | missing citation give several references for the Henry's law constants but don't assign them to specific species. |

Gas phase ion energetics data

Data evaluated as indicated in comments:
HL - Edward P. Hunter and Sharon G. Lias
L - Sharon G. Lias
Data compiled as indicated in comments:
B - John E. Bartmess
LL - Sharon G. Lias and Joel F. Liebman
LLK - Sharon G. Lias, Rhoda D. Levin, and Sherif A. Kafafi
RDSH - Henry M. Rosenstock, Keith Draxl, Bruce W. Steiner, and John T. Herron
Quantity | Value | Units | Method | Reference | Comment |
---|---|---|---|---|---|
IE (evaluated) | 9.1589 ± 0.0005 | eV | N/A | N/A | L |
Quantity | Value | Units | Method | Reference | Comment |
Proton affinity (review) | 718.7 | kJ/mol | N/A | Hunter and Lias, 1998 | HL |
Quantity | Value | Units | Method | Reference | Comment |
Gas basicity | 692.8 | kJ/mol | N/A | Hunter and Lias, 1998 | HL |
Ionization energy determinations
IE (eV) | Method | Reference | Comment |
---|---|---|---|
9.1590 ± 0.0004 | TE | Rieger, Reiser, et al., 1992 | LL |
9.1588 ± 0.0002 | TE | Reiger, 1990 | LL |
9.14 | PE | Bieri, Asbrink, et al., 1981 | LLK |
9.137 ± 0.004 | EQ | Lias and Ausloos, 1978 | LLK |
9.18 | S | Gilbert and Sandorfy, 1974 | LLK |
9.15 ± 0.06 | PE | Clark and Frost, 1967 | RDSH |
9.15 | PI | Bralsford, Harris, et al., 1960 | RDSH |
9.4 | PE | Bieri, Asbrink, et al., 1981 | Vertical value; LLK |
9.29 | PE | Sell, Mintz, et al., 1978 | Vertical value; LLK |
9.15 | PE | Streets and Ceasar, 1973 | Vertical value; LLK |
9.4 ± 0.03 | PE | Klessinger, 1972 | Vertical value; LLK |
Appearance energy determinations
Ion | AE (eV) | Other Products | Method | Reference | Comment |
---|---|---|---|---|---|
C4H2F2+ | 15.27 | C2H2 | EI | Momigny and Wirtz-Cordier, 1962 | RDSH |
C6H4F+ | 15.5 ± 0.1 | F | EI | Majer and Patrick, 1962 | RDSH |
De-protonation reactions
C6H3F2- + =
By formula: C6H3F2- + H+ = C6H4F2
Quantity | Value | Units | Method | Reference | Comment |
---|---|---|---|---|---|
ΔrH° | 1591. ± 8.8 | kJ/mol | G+TS | Buker, Nibbering, et al., 1997 | gas phase; B |
ΔrH° | 1589. ± 13. | kJ/mol | G+TS | Briscese and Riveros, 1975 | gas phase; < MeOH, <= EtOH; value altered from reference due to change in acidity scale; B |
Quantity | Value | Units | Method | Reference | Comment |
ΔrG° | 1557. ± 8.4 | kJ/mol | IMRE | Buker, Nibbering, et al., 1997 | gas phase; B |
ΔrG° | 1555. ± 13. | kJ/mol | IMRB | Briscese and Riveros, 1975 | gas phase; < MeOH, <= EtOH; value altered from reference due to change in acidity scale; B |

Ion clustering data

Data compiled as indicated in comments:
M - Michael M. Meot-Ner (Mautner) and Sharon G. Lias
B - John E. Bartmess
RCD - Robert C. Dunbar
Clustering reactions
By formula: C6H4F2+ + C6H4F2 = (C6H4F2+ • C6H4F2)
Bond type: Charge transfer bond (positive ion)
Quantity | Value | Units | Method | Reference | Comment |
---|---|---|---|---|---|
ΔrH° | 37. | kJ/mol | MPI | Ernstberger, Krause, et al., 1990 | gas phase; M |
By formula: C6H6+ + C6H4F2 = (C6H6+ • C6H4F2)
Bond type: Charge transfer bond (positive ion)
Quantity | Value | Units | Method | Reference | Comment |
---|---|---|---|---|---|
ΔrH° | 47.3 | kJ/mol | MPI | Ernstberger, Krause, et al., 1990 | gas phase; M |
By formula: Cl- + C6H4F2 = (Cl- • C6H4F2)
Quantity | Value | Units | Method | Reference | Comment |
---|---|---|---|---|---|
ΔrH° | 57.7 ± 8.4 | kJ/mol | IMRE | Larson and McMahon, 1984 | gas phase; B,M |
Quantity | Value | Units | Method | Reference | Comment |
ΔrS° | 90.4 | J/mol*K | N/A | Larson and McMahon, 1984 | gas phase; switching reaction(Cl-)ClCOOCH3, Entropy change calculated or estimated; Larson and McMahon, 1984, 2; M |
Quantity | Value | Units | Method | Reference | Comment |
ΔrG° | 31. ± 8.4 | kJ/mol | IMRE | Larson and McMahon, 1984 | gas phase; B,M |
By formula: Cr+ + C6H4F2 = (Cr+ • C6H4F2)
Quantity | Value | Units | Method | Reference | Comment |
---|---|---|---|---|---|
ΔrH° | 121. | kJ/mol | RAK | Ryzhov, 1999 | RCD |
By formula: H4N+ + C6H4F2 = (H4N+ • C6H4F2)
Quantity | Value | Units | Method | Reference | Comment |
---|---|---|---|---|---|
ΔrH° | 54. | kJ/mol | PHPMS | Deakyne and Meot-Ner (Mautner), 1985 | gas phase; Entropy change calculated or estimated; M |
Quantity | Value | Units | Method | Reference | Comment |
ΔrS° | 84. | J/mol*K | N/A | Deakyne and Meot-Ner (Mautner), 1985 | gas phase; Entropy change calculated or estimated; M |
Free energy of reaction
ΔrG° (kJ/mol) | T (K) | Method | Reference | Comment |
---|---|---|---|---|
21. | 395. | PHPMS | Deakyne and Meot-Ner (Mautner), 1985 | gas phase; Entropy change calculated or estimated; M |

Van Den Dool and Kratz RI, non-polar column, temperature ramp

Column type | Active phase | I | Reference | Comment |
---|---|---|---|---|
Packed | SE-30 | 666. | Peng, Ding, et al., 1988 | He, Supelcoport and Chromosorb, 40. C @ 4. min, 10. K/min, 250. C @ 60. min; Column length: 3.05 m |

Normal alkane RI, non-polar column, temperature ramp

Column type | Active phase | I | Reference | Comment |
---|---|---|---|---|
Capillary | OV-101 | 665. | Zenkevich, 2005 | 25. m/0.20 mm/0.10 μm, N2/He, 6. K/min; Tstart: 50. C; Tend: 250. C |

References

Good, Lacina, et al., 1962
Good, W.D.; Lacina, J.L.; Scott, D.W.; McCullough, J.P.,
Combustion calorimetry of organic fluorine compounds. The heats of combustion and formation of the difluorobenzenes, 4-fluorotoluene and m-trifluorotoluic acid,
J. Phys. Chem., 1962, 66, 1529-1532. [all data]
Swarts, 1919
Swarts, F.,
Etudes thermochimiques sur les combinaisons organiques fluorees,
J. Chim. Phys., 1919, 17, 3-70. [all data]
Lichanot, 1991
Lichanot, A.,
Heat capacities of fluroaniline, fluorophenol and difluorobenzene in condensed phase,
Thermochim. Acta, 1991, 177, 265-272. [all data]
PCR Inc., 1990
PCR Inc.,
Research Chemicals Catalog 1990-1991, PCR Inc., Gainesville, FL, 1990, 1. [all data]
Weast and Grasselli, 1989
CRC Handbook of Data on Organic Compounds, 2nd Editon, Weast,R.C and Grasselli, J.G., ed(s)., CRC Press, Inc., Boca Raton, FL, 1989, 1. [all data]
Majer and Svoboda, 1985
Majer, V.; Svoboda, V.,
Enthalpies of Vaporization of Organic Compounds: A Critical Review and Data Compilation, Blackwell Scientific Publications, Oxford, 1985, 300. [all data]
Bergmann, Berkovic, et al., 1956
Bergmann, E.D.; Berkovic, S.; Ikan, R.,
A New Method for the Preparation of Aromatic Fluorine Compounds,
J. Am. Chem. Soc., 1956, 78, 6037-9. [all data]
Goates, Ott, et al., 1976
Goates, J.R.; Ott, J.B.; Moellmer, J.F.,
Solid + Liquid Phase Equilibria and Solid-compound Formation in Halobenzenes + Aromatic Hydrocarbons,
J. Chem. Thermodyn., 1976, 8, 217. [all data]
Osborn and Scott, 1980
Osborn, A.G.; Scott, D.W.,
Vapor pressures of 17 miscellanenous organic compounds,
J. Chem. Thermodyn., 1980, 12, 429-438. [all data]
Basarová and Svoboda, 1991
Basarová, Pavlína; Svoboda, Václav,
Calculation of heats of vaporization of halogenated hydrocarbons from saturated vapour pressure data,
Fluid Phase Equilibria, 1991, 68, 13-34, https://doi.org/10.1016/0378-3812(91)85008-I
. [all data]
Findlay, 1969
Findlay, T.J.V.,
Vapor pressures of fluorobenzenes from 5° to 50°C,
J. Chem. Eng. Data, 1969, 14, 229. [all data]
Buker, Nibbering, et al., 1997
Buker, H.H.; Nibbering, N.M.M.; Espinosa, D.; Mongin, F.; Schlosser, M.,
Additivity of substituent effects in the fluoroarene series: Equilibrium acidity in the gas phase and deprotonation rates in ethereal solution,
Tetrahed. Lett., 1997, 38, 49, 8519-8522, https://doi.org/10.1016/S0040-4039(97)10303-3
. [all data]
Briscese and Riveros, 1975
Briscese, S.M.J.; Riveros, J.M.,
Gas phase nucleophilic reactions of aromatic systems,
J. Am. Chem. Soc., 1975, 97, 230. [all data]
Deakyne and Meot-Ner (Mautner), 1985
Deakyne, C.A.; Meot-Ner (Mautner), M.,
Unconventional Ionic Hydrogen Bonds. 2. NH+ pi. Complexes of Onium Ions with Olefins and Benzene Derivatives,
J. Am. Chem. Soc., 1985, 107, 2, 474, https://doi.org/10.1021/ja00288a034
. [all data]
Larson and McMahon, 1984
Larson, J.W.; McMahon, T.B.,
Hydrogen bonding in gas phase anions. An experimental investigation of the interaction between chloride ion and bronsted acids from ICR chloride exchange equilibria,
J. Am. Chem. Soc., 1984, 106, 517. [all data]
Larson and McMahon, 1984, 2
Larson, J.W.; McMahon, T.B.,
Gas phase negative ion chemistry of alkylchloroformates,
Can. J. Chem., 1984, 62, 675. [all data]
Ernstberger, Krause, et al., 1990
Ernstberger, B.; Krause, H.; Kiermeier, A.; Neusser, H.J.,
Multiphoton ionization and dissociation of mixed van der Waals clusters in a linear reflectron time-of-flight mass spectrometer,
J. Chem. Phys., 1990, 92, 9, 5285, https://doi.org/10.1063/1.458603
. [all data]
Ryzhov, 1999
Ryzhov, V.,
Binding Energies of Chromium Cations with Fluorobenzenes from Radiative Association Kinetics,
Int. J. Mass Spectrom., 1999, 185/186/187, 913. [all data]
Hunter and Lias, 1998
Hunter, E.P.; Lias, S.G.,
Evaluated Gas Phase Basicities and Proton Affinities of Molecules: An Update,
J. Phys. Chem. Ref. Data, 1998, 27, 3, 413-656, https://doi.org/10.1063/1.556018
. [all data]
Rieger, Reiser, et al., 1992
Rieger, D.; Reiser, G.; Muller-Dethlefs, K.; Schlag, E.W.,
Zero kinetic energy photoelectron spectroscopy of p-difluorobenzene,
J. Phys. Chem., 1992, 96, 12. [all data]
Reiger, 1990
Reiger, D.,
[Title unavailable],
Diplomarbeit, Techn. Universitat Munich, 1990. [all data]
Bieri, Asbrink, et al., 1981
Bieri, G.; Asbrink, L.; Von Niessen, W.,
30.4 nm He(II) photoelectron spectra of organic molecules. Part IV. Fluoro-compounds (C,H,F),
J. Electron Spectrosc. Relat. Phenom., 1981, 23, 281. [all data]
Lias and Ausloos, 1978
Lias, S.G.; Ausloos, P.J.,
eIonization energies of organic compounds by equilibrium measurements,
J. Am. Chem. Soc., 1978, 100, 6027. [all data]
Gilbert and Sandorfy, 1974
Gilbert, R.; Sandorfy, C.,
Rydberg transitions in the ultraviolet spectra of difluorobenzenes,
Chem. Phys. Lett., 1974, 27, 457. [all data]
Clark and Frost, 1967
Clark, I.D.; Frost, D.C.,
A study of the energy levels in benzene and some fluorobenzenes by photoelectron spectroscopy,
J. Am. Chem. Soc., 1967, 89, 244. [all data]
Bralsford, Harris, et al., 1960
Bralsford, R.; Harris, P.V.; Price, W.C.,
The effect of fluorine on the electronic spectra and ionization potentials of molecules,
Proc. Roy. Soc. (London), 1960, A258, 459. [all data]
Sell, Mintz, et al., 1978
Sell, J.A.; Mintz, D.M.; Kupperman, A.,
Photoelectron angular distributions of carbon-carbon π electrons in ethylene, benzene, and their fluorinated derivatives,
Chem. Phys. Lett., 1978, 58, 601. [all data]
Streets and Ceasar, 1973
Streets, D.G.; Ceasar, G.P.,
Inductive mesomeric effects on the π orbitals of halobenzenes,
Mol. Phys., 1973, 26, 1037. [all data]
Klessinger, 1972
Klessinger, M.,
Ionization potentials of substituted benzenes,
Angew. Chem. Int. Ed. Engl., 1972, 11, 525. [all data]
Momigny and Wirtz-Cordier, 1962
Momigny, J.; Wirtz-Cordier, A.M.,
Les effets de l'impact electronique sur des derives dihalogenes du benzene,
Ann. Soc. Sci. Bruxelles, 1962, 76, 164. [all data]
Majer and Patrick, 1962
Majer, J.R.; Patrick, C.R.,
Electron impact on some halogenated aromatic compounds,
J. Chem. Soc. Faraday Trans., 1962, 58, 17. [all data]
Peng, Ding, et al., 1988
Peng, C.T.; Ding, S.F.; Hua, R.L.; Yang, Z.C.,
Prediction of Retention Indexes I. Structure-Retention Index Relationship on Apolar Columns,
J. Chromatogr., 1988, 436, 137-172, https://doi.org/10.1016/S0021-9673(00)94575-8
. [all data]
Zenkevich, 2005
Zenkevich, I.G.,
Experimentally measured retention indices., 2005. [all data]