9-Heptadecanone
- Formula: C17H34O
- Molecular weight: 254.4513
- IUPAC Standard InChIKey: WTJKUFMLQFLJOT-UHFFFAOYSA-N
- CAS Registry Number: 540-08-9
- Chemical structure:
View 3d structure (requires JavaScript / HTML 5) - Other names: Dioctyl ketone; Octyl ketone; Di-n-octyl ketone; Pelargone; heptadecan-9-one

Phase change data

Data compiled as indicated in comments:
BS - Robert L. Brown and Stephen E. Stein
TRC - Thermodynamics Research Center, NIST Boulder Laboratories, Chris Muzny director
AC - William E. Acree, Jr., James S. Chickos
Quantity | Value | Units | Method | Reference | Comment |
---|---|---|---|---|---|
Tboil | 524.7 | K | N/A | Weast and Grasselli, 1989 | BS |
Quantity | Value | Units | Method | Reference | Comment |
Tfus | 324. | K | N/A | Vilalta, Hammond, et al., 1993 | Uncertainty assigned by TRC = 0.1 K; TRC |
Enthalpy of vaporization
ΔvapH (kJ/mol) | Temperature (K) | Method | Reference | Comment |
---|---|---|---|---|
78.3 | 454. | A,ME | Stephenson and Malanowski, 1987 | Based on data from 439. to 482. K. See also Ubbelohde, 1938.; AC |
Enthalpy of fusion
ΔfusH (kJ/mol) | Temperature (K) | Reference | Comment |
---|---|---|---|
66.68 | 323.9 | Vilalta, Hammond, et al., 1993, 2 | AC |

References

Weast and Grasselli, 1989
CRC Handbook of Data on Organic Compounds, 2nd Editon, Weast,R.C and Grasselli, J.G., ed(s)., CRC Press, Inc., Boca Raton, FL, 1989, 1. [all data]
Vilalta, Hammond, et al., 1993
Vilalta, P.M.; Hammond, G.S.; Weiss, R.G.,
Determination of the solubilization sites afforded by smectic phases of (perfluorodecyl)decane [F(CF2)10(CH2)10H] to some linear ketones undergoing the Norrish II photoreactions,
Langmuir, 1993, 9, 7, 1910, https://doi.org/10.1021/la00031a046
. [all data]
Stephenson and Malanowski, 1987
Stephenson, Richard M.; Malanowski, Stanislaw,
Handbook of the Thermodynamics of Organic Compounds, 1987, https://doi.org/10.1007/978-94-009-3173-2
. [all data]
Ubbelohde, 1938
Ubbelohde, A.R.,
Structure and thermodynamic properties of long-chain compounds,
Trans. Faraday Soc., 1938, 34, 282, https://doi.org/10.1039/tf9383400282
. [all data]
Vilalta, Hammond, et al., 1993, 2
Vilalta, Patricia M.; Hammond, George S.; Weiss, Richard G.,
Determination of the solubilization sites afforded by smectic phases of (perfluorodecyl)decane [F(CF2)10(CH2)10H] to some linear ketones undergoing the Norrish II photoreactions,
Langmuir, 1993, 9, 7, 1910-1921, https://doi.org/10.1021/la00031a046
. [all data]