Spirocyclohexane-1,2'-[1,3-diazaadamantane]
- Formula: C13H22N2
- Molecular weight: 206.3272
- CAS Registry Number: 53994-42-6

Gas phase ion energetics data

Data compiled by: Sharon G. Lias, Rhoda D. Levin, and Sherif A. Kafafi
Ionization energy determinations
IE (eV) | Method | Reference | Comment |
---|---|---|---|
7.46 | PE | Nelsen and Buschek, 1974 | Vertical value |

References

Nelsen and Buschek, 1974
Nelsen, S.F.; Buschek, J.M.,
Photoelectron spectra of some cyclic di- and polyamines. Lone pair-lone pair interaction in 1,3- and 1,4-diamines,
J. Am. Chem. Soc., 1974, 96, 7930. [all data]