1H-Pyrrole,2-(1,1-dimethylethyl)-
- Formula: C8H13N
- Molecular weight: 123.1955
- IUPAC Standard InChIKey: AJPCQTXGHLEGAY-UHFFFAOYSA-N
- CAS Registry Number: 5398-58-3
- Chemical structure:
View 3d structure (requires JavaScript / HTML 5) - Permanent link for this species. Use this link for bookmarking this species for future reference.

Gas phase ion energetics data

Data compiled by: Sharon G. Lias, Rhoda D. Levin, and Sherif A. Kafafi
Ionization energy determinations
IE (eV) | Method | Reference |
---|---|---|
7.95 ± 0.05 | EI | Linda, Marino, et al., 1971 |

References

Linda, Marino, et al., 1971
Linda, P.; Marino, G.; Pignataro, S.,
A comparison of sensitivities to substituent effects of five- membered heteroaromatic rings in gas phase ionization,
J. Chem. Soc. B, 1971, 1585. [all data]
(editor), 1981
(editor), Koptyug V.A.,
Atlas of Spectra of Aromatic and Heterocyclic Compounds, 1981, 21, 15. [all data]