p-tolylmercury chloride
- Formula: C7H7ClHg
- Molecular weight: 327.17
- CAS Registry Number: 539-43-5

Gas phase ion energetics data

Data compiled as indicated in comments:
LLK - Sharon G. Lias, Rhoda D. Levin, and Sherif A. Kafafi
Ionization energy determinations
IE (eV) | Method | Reference | Comment |
---|---|---|---|
8.7 | PE | Furlani, Piancastelli, et al., 1981 | LLK |
9.10 | PE | Furlani, Piancastelli, et al., 1981 | Vertical value; LLK |

References

Furlani, Piancastelli, et al., 1981
Furlani, C.; Piancastelli, M.N.; Cauletti, C.; Faticanti, F.; Ortaggi, G.,
He(I) and He(II) photoelectron spectra of some organomercury compounds with carbon π-systems,
J. Electron Spectrosc. Relat. Phenom., 1981, 22, 309. [all data]