Methanamine, N,N-dimethyl-1-nitro-
- Formula: C3H8N2O2
- Molecular weight: 104.1078
- IUPAC Standard InChIKey: ULKKJABSEJBPSO-UHFFFAOYSA-N
- CAS Registry Number: 53915-73-4
- Chemical structure:
View 3d structure (requires JavaScript / HTML 5) - Permanent link for this species. Use this link for bookmarking this species for future reference.

Gas phase ion energetics data

Data compiled by: Sharon G. Lias, Rhoda D. Levin, and Sherif A. Kafafi
Ionization energy determinations
IE (eV) | Method | Reference | Comment |
---|---|---|---|
9.17 | PE | Akopyan and Loginov, 1974 | Vertical value |

References

Akopyan and Loginov, 1974
Akopyan, M.E.; Loginov, Yu.V.,
Photoelectron spectra of trimethylamine derivatives,
Opt. Spectrosc., 1974, 37, 250, In original 442. [all data]