Benzenamine, N-(phenylmethylene)-
- Formula: C13H11N
- Molecular weight: 181.2331
- IUPAC Standard InChIKey: UVEWQKMPXAHFST-UHFFFAOYSA-N
- CAS Registry Number: 538-51-2
- Chemical structure:

Condensed phase thermochemistry data

Data compiled by: Hussein Y. Afeefy, Joel F. Liebman, and Stephen E. Stein
Quantity | Value | Units | Method | Reference | Comment |
---|---|---|---|---|---|
ΔfH°solid | 185.0 ± 2.0 | kJ/mol | Ccb | Kirchner, Acree, et al., 1986 | |
Quantity | Value | Units | Method | Reference | Comment |
ΔcH°solid | -6872.7 ± 1.1 | kJ/mol | Ccb | Kirchner, Acree, et al., 1986 | |
ΔcH°solid | -6855.5 ± 7.1 | kJ/mol | Ccb | Coates and Sutton, 1948 | Reanalyzed by Cox and Pilcher, 1970, Original value = -6858. ± 7.1 kJ/mol |

Phase change data

Data compiled as indicated in comments:
TRC - Thermodynamics Research Center, NIST Boulder Laboratories, Chris Muzny director
AC - William E. Acree, Jr., James S. Chickos
ALS - Hussein Y. Afeefy, Joel F. Liebman, and Stephen E. Stein
DRB - Donald R. Burgess, Jr.
Quantity | Value | Units | Method | Reference | Comment |
---|---|---|---|---|---|
Tfus | 324.15 | K | N/A | Meic and Baranovic, 1989 | Uncertainty assigned by TRC = 2. K; TRC |
Quantity | Value | Units | Method | Reference | Comment |
ΔsubH° | 98.1 ± 1.2 | kJ/mol | T | Verevkin, Morgenthaler, et al., 1997 | AC |
ΔsubH° | 93.7 ± 0.9 | kJ/mol | C | Kirchner, Acree, et al., 1986 | ALS |
ΔsubH° | 93.7 | kJ/mol | N/A | Kirchner, Acree, et al., 1986 | DRB |
ΔsubH° | 93.7 ± 0.9 | kJ/mol | C | Kirchner, Acree, et al., 1986 | AC |
Enthalpy of sublimation
ΔsubH (kJ/mol) | Temperature (K) | Method | Reference | Comment |
---|---|---|---|---|
97.4 ± 1.2 | 309. | T | Verevkin, Morgenthaler, et al., 1997 | Based on data from 294. to 326. K.; AC |
85.5 ± 2.1 | 293. | EST | Coates and Sutton, 1948, 2 | AC |
86. ± 2. | 293. | V | Coates and Sutton, 1948 | ALS |
Enthalpy of fusion
ΔfusH (kJ/mol) | Temperature (K) | Reference | Comment |
---|---|---|---|
20.42 | 329.7 | Verevkin, Morgenthaler, et al., 1997 | AC |

Gas phase ion energetics data

Data compiled as indicated in comments:
LLK - Sharon G. Lias, Rhoda D. Levin, and Sherif A. Kafafi
Ionization energy determinations
IE (eV) | Method | Reference | Comment |
---|---|---|---|
8.0 | PE | Akaba, Tokumaru, et al., 1980 | LLK |
8.25 | PE | Akaba, Tokumaru, et al., 1980 | Vertical value; LLK |
8.25 | PE | Kobayashi, Yokota, et al., 1975 | Vertical value; LLK |
8.27 ± 0.05 | PE | Goetz, Marschner, et al., 1974 | Vertical value; LLK |

Gas phase thermochemistry data

Data compiled by: Hussein Y. Afeefy, Joel F. Liebman, and Stephen E. Stein

Quantity Value Units Method Reference Comment
Δfgas278.7 ± 2.2kJ/molCcbKirchner, Acree, et al., 1986

References

Kirchner, Acree, et al., 1986
Kirchner, J.J.; Acree, W.E., Jr.; Pilcher, G.; Shaofeng, L.,
Enthalpies of combustion of four N-phenylmethylene benzenamine N-oxide derivatives, of N-phenylmethylene benzenamine, and of trans-diphenyldiazene N-oxide: the dissociation enthalpy of the (N-O)bonds,
J. Chem. Thermodyn., 1986, 18, 793-799. [all data]
Coates and Sutton, 1948
Coates, G.E.; Sutton, L.E.,
The heats of formation of the -N=N- and >C=N- bonds,
J. Chem. Soc., 1948, 1187-1196. [all data]
Cox and Pilcher, 1970
Cox, J.D.; Pilcher, G.,
Thermochemistry of Organic and Organometallic Compounds, Academic Press, New York, 1970, 1-636. [all data]
Meic and Baranovic, 1989
Meic, Z.; Baranovic, G.,
Vibrational spectra of trans-N-benzylideneaniline and its isotopomers,
Pure Appl. Chem., 1989, 61, 2129. [all data]
Verevkin, Morgenthaler, et al., 1997
Verevkin, Sergey P.; Morgenthaler, Jens; Rüchardt, Christoph,
Thermochemistry of imines: experimental standard molar enthalpies of formation,
The Journal of Chemical Thermodynamics, 1997, 29, 10, 1175-1183, https://doi.org/10.1006/jcht.1997.0242
. [all data]
Coates and Sutton, 1948, 2
Coates, G.E.; Sutton, L.E.,
235. The heats of formation of the ?N?N? and ?C?N? bonds,
J. Chem. Soc., 1948, 1187, https://doi.org/10.1039/jr9480001187
. [all data]
Akaba, Tokumaru, et al., 1980
Akaba, R.; Tokumaru, K.; Kobayashi, T.; Utsunomiya, C.,
Electronic structures conformations of N-benzylideneanilines. II. Photoelectron spectral study,
Bull. Chem. Soc. Jpn., 1980, 53, 2002. [all data]
Kobayashi, Yokota, et al., 1975
Kobayashi, T.; Yokota, K.; Nagakura, S.,
Photoelectron spectra of trans-azobenzene and benzalaniline,
J. Electron Spectrosc. Relat. Phenom., 1975, 6, 167. [all data]
Goetz, Marschner, et al., 1974
Goetz, H.; Marschner, F.; Juds, H.,
Zur n-pi Wechselwirkung im Benzalanilin,
Tetrahedron, 1974, 30, 1133. [all data]