2,3-Diazabicyclo[2.2.1]heptane,2,3-dimethyl-,(2-endo,3-exo)-
- Formula: C7H14N2
- Molecular weight: 126.1995
- IUPAC Standard InChIKey: VAUNORIQTFNCKC-UHFFFAOYSA-N
- CAS Registry Number: 53798-46-2
- Chemical structure:
View 3d structure (requires JavaScript / HTML 5) - Species with the same structure:

Gas phase ion energetics data

Data compiled by: Sharon G. Lias, Rhoda D. Levin, and Sherif A. Kafafi
Ionization energy determinations
IE (eV) | Method | Reference | Comment |
---|---|---|---|
7.66 | PE | Nelsen and Buschek, 1974 | Vertical value |

References

Nelsen and Buschek, 1974
Nelsen, S.F.; Buschek, J.M.,
Photoelectron spectra of hydrazines. V. Pyrazolidine and hexahydropyridazine derivatives,
J. Am. Chem. Soc., 1974, 96, 6987. [all data]