Acetamide, N-(3-methylphenyl)-
- Formula: C9H11NO
- Molecular weight: 149.1897
- IUPAC Standard InChIKey: ALMHSXDYCFOZQD-UHFFFAOYSA-N
- CAS Registry Number: 537-92-8
- Chemical structure:

Condensed phase thermochemistry data

Data compiled by: Hussein Y. Afeefy, Joel F. Liebman, and Stephen E. Stein
Quantity | Value | Units | Method | Reference | Comment |
---|---|---|---|---|---|
ΔcH°solid | -1176.49 | kcal/mol | Ccb | Swarts, 1909 |

Gas phase ion energetics data

Data compiled by: Henry M. Rosenstock, Keith Draxl, Bruce W. Steiner, and John T. Herron
Ionization energy determinations
IE (eV) | Method | Reference |
---|---|---|
8.3 ± 0.2 | EI | Gamble, Gilbert, et al., 1970 |
Appearance energy determinations
Ion | AE (eV) | Other Products | Method | Reference | Comment |
---|---|---|---|---|---|
C7H9N+ | 10.9 ± 0.2 | ? | EI | Gamble, Gilbert, et al., 1970 |

References

Swarts, 1909
Swarts, M.F.,
Sur la chaleur de formation de l'aniline et de quelquesuns de ses derives,
Recl. Trav. Chim. Pays-Bas, 1909, 28, 155-165. [all data]
Gamble, Gilbert, et al., 1970
Gamble, A.A.; Gilbert, J.R.; Tillett, J.G.,
Substituent effects in the fragmentation of acetanilides,,
J. Chem. Soc. B, 1970, 1231. [all data]