2,3-Diazabicyclo[2.2.2]oct-5-ene,1,2,3,4-tetramethyl-
- Formula: C10H18N2
- Molecular weight: 166.2633
- IUPAC Standard InChIKey: PLWYAADDUUXMSE-UHFFFAOYSA-N
- CAS Registry Number: 53779-88-7
- Chemical structure:
View 3d structure (requires JavaScript / HTML 5) - Permanent link for this species. Use this link for bookmarking this species for future reference.

Gas phase ion energetics data

Data compiled by: Sharon G. Lias, Rhoda D. Levin, and Sherif A. Kafafi
Ionization energy determinations
IE (eV) | Method | Reference | Comment |
---|---|---|---|
7.43 | PE | Nelsen and Buschek, 1974 | Vertical value |

References

Nelsen and Buschek, 1974
Nelsen, S.F.; Buschek, J.M.,
Photoelectron spectra of hydrazines. V. Pyrazolidine and hexahydropyridazine derivatives,
J. Am. Chem. Soc., 1974, 96, 6987. [all data]