2,3-Diazabicyclo[2.2.2]octane,2,3-dimethyl-,trans-
- Formula: C8H16N2
- Molecular weight: 140.2260
- IUPAC Standard InChIKey: HIWDJUZJJXARGW-ZKCHVHJHSA-N
- CAS Registry Number: 53779-85-4
- Chemical structure:
View 3d structure (requires JavaScript / HTML 5) - Stereoisomers:

Gas phase ion energetics data

Data compiled by: Sharon G. Lias, Rhoda D. Levin, and Sherif A. Kafafi
Ionization energy determinations
IE (eV) | Method | Reference | Comment |
---|---|---|---|
7.46 | PE | Nelsen and Buschek, 1974 | Vertical value |

References

Nelsen and Buschek, 1974
Nelsen, S.F.; Buschek, J.M.,
Photoelectron spectra of hydrazines. V. Pyrazolidine and hexahydropyridazine derivatives,
J. Am. Chem. Soc., 1974, 96, 6987. [all data]