3-Methyl-3-butenoic acid
- Formula: C5H8O2
- Molecular weight: 100.1158
- IUPAC Standard InChIKey: IGRURXZWJCSNKU-UHFFFAOYSA-N
- CAS Registry Number: 53774-20-2
- Chemical structure:
View 3d structure (requires JavaScript / HTML 5) - Species with the same structure:

Gas phase ion energetics data

Data compiled by: Sharon G. Lias, Rhoda D. Levin, and Sherif A. Kafafi
Ionization energy determinations
IE (eV) | Method | Reference |
---|---|---|
9.52 | PE | Holmes, Terlouw, et al., 1979 |

References

Holmes, Terlouw, et al., 1979
Holmes, J.L.; Terlouw, J.K.; Vijfhuizen, P.C.; A'Campo, C.,
Metastable ion studies XII-Molecular and fragment ion structures for isomeric C4H6O2 acids,
Org. Mass Spectrom., 1979, 14, 204. [all data]