Di-p-tolyl mercury
- Formula: C14H14Hg
- Molecular weight: 382.85
- IUPAC Standard InChIKey: DYGWZUBGVKYLJJ-UHFFFAOYSA-N
- CAS Registry Number: 537-64-4
- Chemical structure:
View 3d structure (requires JavaScript / HTML 5) - Other names: Di-(4-methylphenyl)mercury

Condensed phase thermochemistry data

Data compiled by: Eugene S. Domalski and Elizabeth D. Hearing
Constant pressure heat capacity of solid
Cp,solid (J/mol*K) | Temperature (K) | Reference | Comment |
---|---|---|---|
262.3 | 298.5 | Smith and Andrews, 1931 | T = 102 to 346 K. Value is unsmoothed experimental datum. |

Gas phase ion energetics data

Data compiled as indicated in comments:
LLK - Sharon G. Lias, Rhoda D. Levin, and Sherif A. Kafafi
Ionization energy determinations
IE (eV) | Method | Reference | Comment |
---|---|---|---|
7.94 | PE | Furlani, Piancastelli, et al., 1981 | LLK |
8.53 | PE | Furlani, Piancastelli, et al., 1981 | Vertical value; LLK |

References

Smith and Andrews, 1931
Smith, R.H.; Andrews, D.H.,
Thermal energy studies. II. Phenyl derivatives of metals,
J. Am. Chem. Soc., 1931, 53, 3661-3667. [all data]
Furlani, Piancastelli, et al., 1981
Furlani, C.; Piancastelli, M.N.; Cauletti, C.; Faticanti, F.; Ortaggi, G.,
He(I) and He(II) photoelectron spectra of some organomercury compounds with carbon π-systems,
J. Electron Spectrosc. Relat. Phenom., 1981, 22, 309. [all data]