m-butylaniline
- Formula: C10H15N
- Molecular weight: 149.2328
- IUPAC Standard InChIKey: WMIQWIJPGVVMII-UHFFFAOYSA-N
- CAS Registry Number: 5369-17-5
- Chemical structure:
View 3d structure (requires JavaScript / HTML 5) - Other names: Benzenamine, 3-butyl-

Gas phase ion energetics data

Data compiled by: Sharon G. Lias, Rhoda D. Levin, and Sherif A. Kafafi
Ionization energy determinations
IE (eV) | Method | Reference |
---|---|---|
7.5 ± 0.1 | EI | Lightner, Majeti, et al., 1972 |
Appearance energy determinations
Ion | AE (eV) | Other Products | Method | Reference | Comment |
---|---|---|---|---|---|
C7H8N+ | 12.1 ± 0.1 | ? | EI | Lightner, Majeti, et al., 1972 | |
C7H9N+ | 10.1 ± 0.1 | CH2=CHCH3 | EI | Lightner, Majeti, et al., 1972 |

References

Lightner, Majeti, et al., 1972
Lightner, D.A.; Majeti, S.; Nicoletti, R.; Thommen, E.,
Benzyl vs. tropylium ions in the electron impact induced decomposition of n- butylbenzenes,
Intra-Sci. Chem. Rep., 1972, 6, 113. [all data]