Benzenamine, 3-methoxy-
- Formula: C7H9NO
- Molecular weight: 123.1525
- IUPAC Standard InChIKey: NCBZRJODKRCREW-UHFFFAOYSA-N
- CAS Registry Number: 536-90-3
- Chemical structure:
View 3d structure (requires JavaScript / HTML 5) - Other names: m-Anisidine; m-Aminoanisole; m-Anisylamine; m-Methoxyaniline; 1-Amino-3-methoxybenzene; 3-Aminoanisole; 3-Methoxyaniline; 3-Methoxybenzenamine; 3-Anisidine; 3-Aminophenol methyl ether; 3-Methoxy-1-aminobenzene; m-Aminomethoxybenzene; NSC 7631

Phase change data

Data compiled by: Robert L. Brown and Stephen E. Stein
Quantity | Value | Units | Method | Reference | Comment |
---|---|---|---|---|---|
Tboil | 524.2 | K | N/A | Weast and Grasselli, 1989 |

Gas phase ion energetics data

Data evaluated as indicated in comments:
HL - Edward P. Hunter and Sharon G. Lias
Data compiled as indicated in comments:
RDSH - Henry M. Rosenstock, Keith Draxl, Bruce W. Steiner, and John T. Herron
Quantity | Value | Units | Method | Reference | Comment |
---|---|---|---|---|---|
Proton affinity (review) | 913.0 | kJ/mol | N/A | Hunter and Lias, 1998 | HL |
Quantity | Value | Units | Method | Reference | Comment |
Gas basicity | 881.1 | kJ/mol | N/A | Hunter and Lias, 1998 | HL |
Ionization energy determinations
IE (eV) | Method | Reference | Comment |
---|---|---|---|
7.8 ± 0.1 | EI | Brown, 1970 | RDSH |
Appearance energy determinations
Ion | AE (eV) | Other Products | Method | Reference | Comment |
---|---|---|---|---|---|
C6H6NO+ | 11.1 ± 0.1 | CH3 | EI | Brown, 1970 | RDSH |
C6H7N+ | 10.5 ± 0.1 | CH2O | EI | Brown, 1970 | RDSH |

Kovats' RI, non-polar column, isothermal

Data compiled by: NIST Mass Spectrometry Data Center, William E. Wallace, director

Column type PackedPacked
Active phase SE-30SE-30
Column length (m) 3.3.
Carrier gas N2N2
Substrate Chromosorb A AWChromosorb W AW
Column diameter (mm)
Phase thickness (μm)
Temperature (C) 180.180.
I 1229.1229.
ReferenceOszczapowicz, Osek, et al., 1985Oszczapowicz, Osek, et al., 1984
Comment MSDC-RI MSDC-RI

Van Den Dool and Kratz RI, non-polar column, temperature ramp

View large format table.

Column type Active phase I Reference Comment
CapillaryOV-11198.1Gautzsch and Zinn, 19968. K/min; Tstart: 35. C; Tend: 300. C

Normal alkane RI, polar column, custom temperature program

View large format table.

Column type Active phase I Reference Comment
CapillaryDB-Wax2176.Peng, Yang, et al., 1991Program: not specified

References

Weast and Grasselli, 1989
CRC Handbook of Data on Organic Compounds, 2nd Editon, Weast,R.C and Grasselli, J.G., ed(s)., CRC Press, Inc., Boca Raton, FL, 1989, 1. [all data]
Hunter and Lias, 1998
Hunter, E.P.; Lias, S.G.,
Evaluated Gas Phase Basicities and Proton Affinities of Molecules: An Update,
J. Phys. Chem. Ref. Data, 1998, 27, 3, 413-656, https://doi.org/10.1063/1.556018
. [all data]
Brown, 1970
Brown, P.,
Kinetic studies in mass spectrometry. VIII. Competing [M-CH3] and [M-CH2O] reactions in substituted anisoles. Approximate activation energies from ionization appearance potentials,
Org. Mass Spectrom., 1970, 4, 519. [all data]
Grammaticakis, 1951
Grammaticakis, P.,
Contribution a l'etude de l'absorption dans l'ultraviolet moyen et le visible des arylamines isomeres et de leurs derives N substitues (Premier memoire),
Bull. Soc. Chim. Fr., 1951, 18, 220-226. [all data]