2-Hexyne, 5-methyl-
- Formula: C7H12
- Molecular weight: 96.1702
- IUPAC Standard InChIKey: SVGAHRUSRQTQES-UHFFFAOYSA-N
- CAS Registry Number: 53566-37-3
- Chemical structure:

Gas phase thermochemistry data

Data compiled by: Glushko Thermocenter, Russian Academy of Sciences, Moscow
Constant pressure heat capacity of gas
Cp,gas (J/mol*K) | Temperature (K) | Reference | Comment |
---|---|---|---|
51.12 | 50. | Thermodynamics Research Center, 1997 | p=1 bar. |
72.05 | 100. | ||
91.71 | 150. | ||
109.11 | 200. | ||
135.24 | 273.15 | ||
144.58 | 298.15 | ||
145.28 | 300. | ||
182.35 | 400. | ||
215.69 | 500. | ||
244.19 | 600. | ||
268.50 | 700. | ||
289.38 | 800. | ||
307.41 | 900. | ||
323.01 | 1000. | ||
336.5 | 1100. | ||
348.2 | 1200. | ||
358.3 | 1300. | ||
367.1 | 1400. | ||
374.7 | 1500. |

Phase change data

Data compiled as indicated in comments:
BS - Robert L. Brown and Stephen E. Stein
TRC - Thermodynamics Research Center, NIST Boulder Laboratories, Chris Muzny director
Quantity | Value | Units | Method | Reference | Comment |
---|---|---|---|---|---|
Tboil | 375. | K | N/A | Farchan Laboratories, 1990 | BS |
Tboil | 375.61 | K | N/A | Pomerantz, Fookson, et al., 1954 | Uncertainty assigned by TRC = 0.3 K; TRC |
Tboil | 375.29 | K | N/A | Anonymous, 1953 | Uncertainty assigned by TRC = 0.3 K; TRC |
Tboil | 376. | K | N/A | Petrov, Verentsova, et al., 1941 | Uncertainty assigned by TRC = 6. K; TRC |
Quantity | Value | Units | Method | Reference | Comment |
Ttriple | 180.54 | K | N/A | Pomerantz, Fookson, et al., 1954 | Uncertainty assigned by TRC = 0.2 K; TRC |

Gas phase ion energetics data

Data compiled by: Sharon G. Lias, Rhoda D. Levin, and Sherif A. Kafafi
Ionization energy determinations
IE (eV) | Method | Reference |
---|---|---|
9.320 ± 0.005 | PE | Carlier, Dubois, et al., 1975 |

Kovats' RI, non-polar column, isothermal

Column type | Active phase | Temperature (C) | I | Reference | Comment |
---|---|---|---|---|---|
Capillary | Squalane | 80. | 701. | Soják, Farkas, et al., 1991 | 107. m/0.25 mm/0.40 μm, H2 |

References

Thermodynamics Research Center, 1997
Thermodynamics Research Center,
Selected Values of Properties of Chemical Compounds., Thermodynamics Research Center, Texas A&M University, College Station, Texas, 1997. [all data]
Farchan Laboratories, 1990
Farchan Laboratories,
Research Chemicals Catalog, Farchan Laboratories, Gainesville, FL, 1990, 91. [all data]
Pomerantz, Fookson, et al., 1954
Pomerantz, P.; Fookson, A.; Mears, T.W.; Rothberg, S.; Howard, F.L.,
Synthesis and Physical Properties of Several Acetylenic Hydrocarbons,
J. Res. Natl. Bur. Stand. (U. S.), 1954, 52, 51. [all data]
Anonymous, 1953
Anonymous, R.,
, Physical Properties of Chemical Substances, Dow Chemical Company, 1953. [all data]
Petrov, Verentsova, et al., 1941
Petrov, A.D.; Verentsova, N.I.; Kokleeva, T.A.,
Synthesis of 2-Methyl-4-hexyne and 2,5-Dimethyl-3-heptyne,
Zh. Obshch. Khim., 1941, 11, 1096. [all data]
Carlier, Dubois, et al., 1975
Carlier, P.; Dubois, J.E.; Masclet, P.; Mouvier, G.,
Spectres de photoelectrons des alcynes,
J. Electron Spectrosc. Relat. Phenom., 1975, 7, 55. [all data]
Soják, Farkas, et al., 1991
Soják, L.; Farkas, P.; Ostrovský, I.; Janák, J.; Chrétien, J.R.,
Capillary gas chromatography of C5 - C13 branched alkynes on squalane and liquid crystal stationary phases,
J. Chromatogr., 1991, 557, 241-253, https://doi.org/10.1016/S0021-9673(01)87136-3
. [all data]