Germane, acetyltrimethyl-
- Formula: C5H12GeO
- Molecular weight: 160.79
- IUPAC Standard InChIKey: ONYRXAJVVBDOHE-UHFFFAOYSA-N
- CAS Registry Number: 53520-45-9
- Chemical structure:
View 3d structure (requires JavaScript / HTML 5) - Permanent link for this species. Use this link for bookmarking this species for future reference.

Gas phase ion energetics data

Data compiled by: Sharon G. Lias, Rhoda D. Levin, and Sherif A. Kafafi
Ionization energy determinations
IE (eV) | Method | Reference | Comment |
---|---|---|---|
8.5 | PE | Ramsey, Brock, et al., 1974 | Vertical value |

References

Ramsey, Brock, et al., 1974
Ramsey, B.G.; Brock, A.; Bassindale, A.R.; Bock, H.,
σπ, a reassignment of the long wavelength UV transition in acyl-silanes and -germanes by photoelectron spectroscopy,
J. Organomet. Chem., 1974, 74, 41. [all data]