4-Nonen-2-yne, (Z)-
- Formula: C9H14
- Molecular weight: 122.2075
- IUPAC Standard InChIKey: AIDMRHRNBMILQM-HJWRWDBZSA-N
- CAS Registry Number: 53497-78-2
- Chemical structure:
View 3d structure (requires JavaScript / HTML 5) - Stereoisomers:
- Other names: Non-2-yn-4-ene, (Z)-

Gas phase ion energetics data

Data compiled by: Sharon G. Lias, Rhoda D. Levin, and Sherif A. Kafafi
Ionization energy determinations
IE (eV) | Method | Reference |
---|---|---|
8.46 ± 0.01 | PE | Carlier, Mouvier, et al., 1979 |

References

Carlier, Mouvier, et al., 1979
Carlier, P.; Mouvier, G.; Mesnard, D.; Miginiac, L.,
Etude par spectrometrie de photoelectrons de la structure electronique des phenyl-alcynes conjugues,
J. Electron Spectrosc. Relat. Phenom., 1979, 16, 147. [all data]