1,2-dithiole-3-thione
- Formula: C3H2S3
- Molecular weight: 134.243
- IUPAC Standard InChIKey: LZENMJMJWQSSNJ-UHFFFAOYSA-N
- CAS Registry Number: 534-25-8
- Chemical structure:
View 3d structure (requires JavaScript / HTML 5) - Other names: 3H-1,2-Dithiole-3-thione

Gas phase ion energetics data

Data compiled by: Sharon G. Lias, Rhoda D. Levin, and Sherif A. Kafafi
Ionization energy determinations
IE (eV) | Method | Reference | Comment |
---|---|---|---|
8.42 | PE | Gonbeau, Guimon, et al., 1975 | Vertical value |

References

Gonbeau, Guimon, et al., 1975
Gonbeau, D.; Guimon, C.; Deschamps, J.; Pfister-Guillouzo, G.,
Electronic structure of sulphur compounds IX. Photoelectron spectra of various 1,2-dithiole-3-thiones,
J. Electron Spectrosc. Relat. Phenom., 1975, 6, 99. [all data]