Oxirane, (ethylthiomethyl)-
- Formula: C5H10OS
- Molecular weight: 118.197
- IUPAC Standard InChIKey: KDSVXIGJVLFKOE-UHFFFAOYSA-N
- CAS Registry Number: 53414-23-6
- Chemical structure:
View 3d structure (requires JavaScript / HTML 5) - Permanent link for this species. Use this link for bookmarking this species for future reference.

Gas phase ion energetics data

Data compiled by: Sharon G. Lias and Joel F. Liebman
Ionization energy determinations
IE (eV) | Method | Reference |
---|---|---|
8.89 | EI | Vorob'ev, Furlei, et al., 1989 |

References

Vorob'ev, Furlei, et al., 1989
Vorob'ev, A.S.; Furlei, I.I.; Sultanov, A.S.; Khvostenko, V.I.; Leplyanin, G.V.; Derzhinskii, A.R.; Tolstikov, G.A.,
Mass spectrometry of reasonance capture of electrons and photoelectron spectroscopy of molecules of ethylene oxide, ethylene sulfide, and their derivatives,
Bull. Acad. Sci. USSR, Div. Chem. Sci., 1989, 1388. [all data]