Dibenzo[a,e]cyclooctene,5,6,11,12-tetradehydro-
- Formula: C16H8
- Molecular weight: 200.2347
- IUPAC Standard InChIKey: JFYLRMKUYCIWMX-UHFFFAOYSA-N
- CAS Registry Number: 53397-65-2
- Chemical structure:
View 3d structure (requires JavaScript / HTML 5) - Permanent link for this species. Use this link for bookmarking this species for future reference.

Gas phase ion energetics data

Data compiled by: Sharon G. Lias, Rhoda D. Levin, and Sherif A. Kafafi
Ionization energy determinations
IE (eV) | Method | Reference | Comment |
---|---|---|---|
7.76 | PE | Wirz, 1976 | Vertical value |

References

Wirz, 1976
Wirz, J.,
173. Electronic structure and photophysical properties of planar conjugated hydrocarbons with 4n-membered rings. I. Photoelectron spectra of 1,5,9-tridehydro[12]-annulene and related compounds,
Helv. Chim. Acta, 1976, 59, 1647. [all data]