Benzene, 1-(2-bromoethyl)-4-nitro-
- Formula: C8H8BrNO2
- Molecular weight: 230.059
- IUPAC Standard InChIKey: NTURQZFFJDCTMZ-UHFFFAOYSA-N
- CAS Registry Number: 5339-26-4
- Chemical structure:
View 3d structure (requires JavaScript / HTML 5) - Other names: β-(p-Nitrophenyl)ethyl bromide; p-Nitrophenethyl bromide; 1-(2-Bromoethyl)-4-nitrobenzene; 2-(4-Nitrophenyl)ethyl bromide; 4-(2-Bromoethyl)nitrobenzene; 1-Bromo-2-(4-nitrophenyl)ethane; 4-nitrophenethyl bromide

Gas phase ion energetics data

Data compiled by: Henry M. Rosenstock, Keith Draxl, Bruce W. Steiner, and John T. Herron
Ionization energy determinations
IE (eV) | Method | Reference |
---|---|---|
9.6 | EI | Grutzmacher, 1970 |
Appearance energy determinations
Ion | AE (eV) | Other Products | Method | Reference | Comment |
---|---|---|---|---|---|
C8H8NO2+ | 10.3 | Br | EI | Grutzmacher, 1970 |

References

Grutzmacher, 1970
Grutzmacher, H.-F.,
Zum Mechanismus massenspektrometrischer Fragmentierungsreaktionen-IV: zur Bildung von Phenonium-Ionen bei der Elektronenstoss-Fragmentierung von -Phenylathylbromiden,
Org. Mass Spectrom., 1970, 3, 131. [all data]