Pentamethyl tantalum
- Formula: C5H15Ta
- Molecular weight: 256.1205
- CAS Registry Number: 53378-72-6

Gas phase thermochemistry data

Data compiled by: José A. Martinho Simões
Quantity | Value | Units | Method | Reference | Comment |
---|---|---|---|---|---|
ΔfH°gas | 213. ± 27. | kJ/mol | Review | Martinho Simões |

Phase change data

Data compiled by: José A. Martinho Simões
Quantity | Value | Units | Method | Reference | Comment |
---|---|---|---|---|---|
ΔvapH° | 42.0 ± 4.2 | kJ/mol | RSC | Adedeji, Connor J.A., et al., 1976 |

Gas phase ion energetics data

Data compiled as indicated in comments:
LLK - Sharon G. Lias, Rhoda D. Levin, and Sherif A. Kafafi
Ionization energy determinations
IE (eV) | Method | Reference | Comment |
---|---|---|---|
8.2 | PE | Galyer, Wilkinson, et al., 1975 | LLK |
8.83 ± 0.02 | PE | Green, Lloyd, et al., 1978 | Vertical value; LLK |
8.7 | PE | Galyer, Wilkinson, et al., 1975 | Vertical value; LLK |

Condensed phase thermochemistry data

Data compiled by: José A. Martinho Simões
Quantity | Value | Units | Method | Reference | Comment |
---|---|---|---|---|---|
ΔfH°liquid | 171. ± 26. | kJ/mol | Review | Martinho Simões |

Reaction thermochemistry data

Data compiled by: José A. Martinho Simões
Individual Reactions
C5H15Ta (l) + 2.5 (l) = 0.5O5Ta2 (cr) + 5
(g)
By formula: C5H15Ta (l) + 2.5H2O (l) = 0.5O5Ta2 (cr) + 5CH4 (g)
Quantity | Value | Units | Method | Reference | Comment |
---|---|---|---|---|---|
ΔrH° | -853. ± 26. | kJ/mol | RSC | Adedeji, Connor J.A., et al., 1976 |

References

Martinho Simões
Martinho Simões, J.A.,
Private communication (see http://webbook.nist.gov/chemistry/om/). [all data]
Adedeji, Connor J.A., et al., 1976
Adedeji, F.A.; Connor J.A.; Skinner, H.A.; Galyer, L.; Wilkinson, G.,
J. Chem. Soc., Chem. Commun., 1976, 159.. [all data]
Galyer, Wilkinson, et al., 1975
Galyer, L.; Wilkinson, G.; Lloyd, D.R.,
The photoelectron spectra of hexamethyltungsten and pentamethyltantalum,
J. Chem. Soc., Chem. Commun., 1975, 497. [all data]
Green, Lloyd, et al., 1978
Green, J.C.; Lloyd, D.R.; Galyer, L.; Mertis, K.; Wilkinson, G.,
Photoelectron spectra of some transition metal alkyls and oxoalkyls,
J. Chem. Soc. Dalton Trans., 1978, 10, 1403. [all data]