2,4,6-Cycloheptatrien-1-one, 2-hydroxy-
- Formula: C7H6O2
- Molecular weight: 122.1213
- IUPAC Standard InChIKey: MDYOLVRUBBJPFM-UHFFFAOYSA-N
- CAS Registry Number: 533-75-5
- Chemical structure:
View 3d structure (requires JavaScript / HTML 5) - Other names: Tropolone; Purpurocatechol; 2-Hydroxy-2,4,6-cycloheptatriene-1-one; 2-Hydroxy-2,4,6-cycloheptatrien-1-one; 2-hydroxycyclohepta-2,4,6-trienone

Gas phase thermochemistry data

Data compiled by: Hussein Y. Afeefy, Joel F. Liebman, and Stephen E. Stein
Quantity | Value | Units | Method | Reference | Comment |
---|---|---|---|---|---|
ΔfH°gas | -156. ± 1. | kJ/mol | Ccb | Hubbard, Katz, et al., 1952 | |
ΔfH°gas | -155. | kJ/mol | Ccb | Cook, Gibb, et al., 1951 |

Condensed phase thermochemistry data

Data compiled by: Hussein Y. Afeefy, Joel F. Liebman, and Stephen E. Stein
Quantity | Value | Units | Method | Reference | Comment |
---|---|---|---|---|---|
ΔfH°solid | -239.7 ± 2.6 | kJ/mol | Ccb | Tanaka and Watase, 1956 | Reanalyzed by Cox and Pilcher, 1970, Original value = -240. kJ/mol |
ΔfH°solid | -239.5 ± 0.8 | kJ/mol | Ccb | Hubbard, Katz, et al., 1952 | |
ΔfH°solid | -239. | kJ/mol | Ccb | Cook, Gibb, et al., 1951 | |
Quantity | Value | Units | Method | Reference | Comment |
ΔcH°solid | -3382. ± 2. | kJ/mol | Ccb | Jackson, Hung, et al., 1971 | Corresponding ΔfHºsolid = -230. kJ/mol (simple calculation by NIST; no Washburn corrections) |
ΔcH°solid | -3370. | kJ/mol | Ccb | Tanaka and Watase, 1956 | Corresponding ΔfHºsolid = -240. kJ/mol (simple calculation by NIST; no Washburn corrections) |
ΔcH°solid | -3372.6 | kJ/mol | Ccb | Hubbard, Katz, et al., 1952 | Corresponding ΔfHºsolid = -239.4 kJ/mol (simple calculation by NIST; no Washburn corrections) |
ΔcH°solid | -3373. ± 4. | kJ/mol | Ccb | Cook, Gibb, et al., 1951 | Corresponding ΔfHºsolid = -239. kJ/mol (simple calculation by NIST; no Washburn corrections) |

Phase change data

Data compiled as indicated in comments:
ALS - Hussein Y. Afeefy, Joel F. Liebman, and Stephen E. Stein
AC - William E. Acree, Jr., James S. Chickos
Quantity | Value | Units | Method | Reference | Comment |
---|---|---|---|---|---|
ΔsubH° | 83.7 ± 0.8 | kJ/mol | V | Hubbard, Katz, et al., 1952 | ALS |
ΔsubH° | 83.7 ± 0.8 | kJ/mol | N/A | Cook, Gibb, et al., 1951, 2 | See also Cox and Pilcher, 1970, 2.; AC |
ΔsubH° | 83.7 ± 0.8 | kJ/mol | E | Cook, Gibb, et al., 1951 | ALS |
Enthalpy of sublimation
ΔsubH (kJ/mol) | Temperature (K) | Method | Reference | Comment |
---|---|---|---|---|
84.1 ± 0.4 | 297.0 ± 0.5 | V | Jackson, Hung, et al., 1971 | ALS |
84.1 ± 0.4 | 273. to 333. | ME | Jackson, Hung, et al., 1971 | AC |

Gas phase ion energetics data

Data compiled as indicated in comments:
RDSH - Henry M. Rosenstock, Keith Draxl, Bruce W. Steiner, and John T. Herron
Ionization energy determinations
IE (eV) | Method | Reference | Comment |
---|---|---|---|
9.86 ± 0.02 | EI | Higasi, Nozoe, et al., 1957 | RDSH |
Appearance energy determinations
Ion | AE (eV) | Other Products | Method | Reference | Comment |
---|---|---|---|---|---|
C6H6O+ | 10.8 | CO | EI | Williams, Cooks, et al., 1968 | RDSH |

Normal alkane RI, polar column, temperature ramp

Column type | Active phase | I | Reference | Comment |
---|---|---|---|---|
Capillary | DB-Wax | 2003. | Souza, Re-Poppi, et al., 2012 | 30. m/0.25 mm/0.25 μm, Helium, 60. C @ 1. min, 5. K/min; Tend: 240. C |

References

Hubbard, Katz, et al., 1952
Hubbard, W.N.; Katz, C.; Guthrie, G.B., Jr.; Waddington, G.,
The heat of combustion and resonance energy of tropolone,
J. Am. Chem. Soc., 1952, 74, 4456-44. [all data]
Cook, Gibb, et al., 1951
Cook, J.W.; Gibb, A.R.; Raphael, R.A.; Somerville, A.R.,
Tropolones. Part I. The preparation and general characteristics of tropolone,
J. Chem. Soc., 1951, 503-511. [all data]
Tanaka and Watase, 1956
Tanaka, T.; Watase, T.,
Resonance energies of tropolone and hinokitiol,
Tech. Rpt., Osaka Univ., 1956, 6, 367-371. [all data]
Cox and Pilcher, 1970
Cox, J.D.; Pilcher, G.,
Thermochemistry of Organic and Organometallic Compounds, Academic Press, New York, 1970, 1-636. [all data]
Jackson, Hung, et al., 1971
Jackson, W.; Hung, T.S.; Hopkins, H.P., Jr.,
Delocalization energies of troponoids from bomb calorimetric and vapour pressure measurements,
J. Chem. Thermodyn., 1971, 3, 347-353. [all data]
Cook, Gibb, et al., 1951, 2
Cook, J.W.; Gibb, A.R.; Raphael, R.A.; Somerville, A.R.,
107. Tropolones. Part I. The preparation and general characteristics of tropolone,
J. Chem. Soc., 1951, 503, https://doi.org/10.1039/jr9510000503
. [all data]
Cox and Pilcher, 1970, 2
Cox, J.D.; Pilcher, G.,
Thermochemistry of Organic and Organometallic Compounds, Academic Press Inc., London, 1970, 643. [all data]
Higasi, Nozoe, et al., 1957
Higasi, K.; Nozoe, T.; Omura, I.,
Ionization potentials of some organic molecules. IV. Troponoid compounds,
Bull. Chem. Soc. Japan, 1957, 30, 408. [all data]
Williams, Cooks, et al., 1968
Williams, D.H.; Cooks, R.G.; Howe, I.,
Studies in mass spectrometry. XXXI. A comparison of reaction rates in common ions generated via fragmentation and direct ionization,
J. Am. Chem. Soc., 1968, 90, 6759. [all data]
Aulin-Erdtman and Forbes, 1967
Aulin-Erdtman, G.; Forbes, E.J.,
UV atlas of organic compounds, 1967, 3, F3/3. [all data]
Souza, Re-Poppi, et al., 2012
Souza, J.B.G.; Re-Poppi, N.; Raposo, J.L.(Jr).,
Characterization of pyroligneous acid used in agriculture by gas chromatography - mass spectrometry (in press),
J. Braz. Chem. Soc., 2012, 00, 00, 1-8. [all data]