5H-1-Pyrindine, 6,7-dihydro-
- Formula: C8H9N
- Molecular weight: 119.1638
- IUPAC Standard InChIKey: KRNSYSYRLQDHDK-UHFFFAOYSA-N
- CAS Registry Number: 533-37-9
- Chemical structure:
View 3d structure (requires JavaScript / HTML 5) - Other names: 2,3-Cyclopentenopyridine; Pyrindan; Cyclopenta[b]pyridine; 5H-1-Pyrindene, 6,7-dihydro-; 6,7-dihydro-5H-cyclopenta(b)pyridine

Phase change data

Data compiled by: Robert L. Brown and Stephen E. Stein
Reduced pressure boiling point
Tboil (K) | Pressure (bar) | Reference |
---|---|---|
360.7 | 0.015 | Aldrich Chemical Company Inc., 1990 |

Gas phase ion energetics data

Data evaluated as indicated in comments:
HL - Edward P. Hunter and Sharon G. Lias
Data compiled as indicated in comments:
LLK - Sharon G. Lias, Rhoda D. Levin, and Sherif A. Kafafi
Quantity | Value | Units | Method | Reference | Comment |
---|---|---|---|---|---|
Proton affinity (review) | 957.5 | kJ/mol | N/A | Hunter and Lias, 1998 | HL |
Quantity | Value | Units | Method | Reference | Comment |
Gas basicity | 925.6 | kJ/mol | N/A | Hunter and Lias, 1998 | HL |
Ionization energy determinations
IE (eV) | Method | Reference | Comment |
---|---|---|---|
9.15 | PE | Aue and Bowers, 1979 | Vertical value; LLK |

References

Aldrich Chemical Company Inc., 1990
Aldrich Chemical Company Inc.,
Catalog Handbook of Fine Chemicals, Aldrich Chemical Company, Inc., Milwaukee WI, 1990, 1. [all data]
Hunter and Lias, 1998
Hunter, E.P.; Lias, S.G.,
Evaluated Gas Phase Basicities and Proton Affinities of Molecules: An Update,
J. Phys. Chem. Ref. Data, 1998, 27, 3, 413-656, https://doi.org/10.1063/1.556018
. [all data]
Aue and Bowers, 1979
Aue, D.H.; Bowers, M.T.,
Chapter 9. Stabilities of positive ions from equilibrium gas phase basicity measurements
in Ions Chemistry,, ed. M.T. Bowers, 1979. [all data]
Godar and Mariella, 1957
Godar, E.; Mariella, R.P.,
J. Am. Chem. Soc., 1957, 79, 1402. [all data]