1-Propanamine, 3-methoxy-
- Formula: C4H11NO
- Molecular weight: 89.1362
- IUPAC Standard InChIKey: FAXDZWQIWUSWJH-UHFFFAOYSA-N
- CAS Registry Number: 5332-73-0
- Chemical structure:
View 3d structure (requires JavaScript / HTML 5) - Other names: Propylamine, 3-methoxy-; γ-Methoxypropylamine; 1-Amino-3-methoxypropane; 3-Aminopropyl methyl ether; 3-Methoxy-n-propylamine; 3-Methoxy-1-propanamine; 3-Methoxypropylamine; 3-Methyoxypropylamine; 3-Methoxy-1-propylamine; 3-MPA; 1-Methoxy-3-aminopropane; NSC 552; Propanolamine methyl ether

Condensed phase thermochemistry data

Data compiled by: Eugene S. Domalski and Elizabeth D. Hearing
Quantity | Value | Units | Method | Reference | Comment |
---|---|---|---|---|---|
S°liquid | 257.6 | J/mol*K | N/A | Geidarov and Karasharli, 1984 |
Constant pressure heat capacity of liquid
Cp,liquid (J/mol*K) | Temperature (K) | Reference | Comment |
---|---|---|---|
225.52 | 298.15 | Geidarov and Karasharli, 1984 | T = 55 to 300 K. |

Phase change data

Data compiled as indicated in comments:
BS - Robert L. Brown and Stephen E. Stein
DH - Eugene S. Domalski and Elizabeth D. Hearing
TRC - Thermodynamics Research Center, NIST Boulder Laboratories, Chris Muzny director
AC - William E. Acree, Jr., James S. Chickos
Quantity | Value | Units | Method | Reference | Comment |
---|---|---|---|---|---|
Tfus | 135. | K | N/A | Geidarov and Karasharli, 1984 | DH |
Tfus | 197.2 | K | N/A | Witschonke, 1954 | Uncertainty assigned by TRC = 0.2 K; TRC |
Tfus | 197.45 | K | N/A | Witschonke, 1954 | Uncertainty assigned by TRC = 0.15 K; TRC |
Reduced pressure boiling point
Tboil (K) | Pressure (bar) | Reference | Comment |
---|---|---|---|
390.7 | 0.977 | Aldrich Chemical Company Inc., 1990 | BS |
Enthalpy of vaporization
ΔvapH (kJ/mol) | Temperature (K) | Method | Reference | Comment |
---|---|---|---|---|
44.5 | 293. | A | Stephenson and Malanowski, 1987 | Based on data from 278. to 390. K.; AC |

Gas phase ion energetics data

Data compiled by: Sharon G. Lias, Rhoda D. Levin, and Sherif A. Kafafi
Ionization energy determinations
IE (eV) | Method | Reference | Comment |
---|---|---|---|
9.37 ± 0.12 | PE | Leavell, Steichen, et al., 1973 | Vertical value |

References

Geidarov and Karasharli, 1984
Geidarov, Kh.I.; Karasharli, K.A.,
Study of the true heat capacity of 3-methoxypropylamine in the 55-300 K range,
Azerb. Khim. Zhur., 1984, (1), 142-145. [all data]
Witschonke, 1954
Witschonke, C.R.,
Freezing point and purity data for some organic compounds,
Anal. Chem., 1954, 26, 562-4. [all data]
Aldrich Chemical Company Inc., 1990
Aldrich Chemical Company Inc.,
Catalog Handbook of Fine Chemicals, Aldrich Chemical Company, Inc., Milwaukee WI, 1990, 1. [all data]
Stephenson and Malanowski, 1987
Stephenson, Richard M.; Malanowski, Stanislaw,
Handbook of the Thermodynamics of Organic Compounds, 1987, https://doi.org/10.1007/978-94-009-3173-2
. [all data]
Leavell, Steichen, et al., 1973
Leavell, S.; Steichen, J.; Franklin, J.L.,
Photoelectron spectra of intramolecularly hydrogen bonded compounds,
J. Chem. Phys., 1973, 59, 4343. [all data]