Acetic acid, 2-methylphenyl ester
- Formula: C9H10O2
- Molecular weight: 150.1745
- IUPAC Standard InChIKey: AMZORBZSQRUXNC-UHFFFAOYSA-N
- CAS Registry Number: 533-18-6
- Chemical structure:

Gas phase ion energetics data

Data compiled by: Sharon G. Lias, Rhoda D. Levin, and Sherif A. Kafafi
Ionization energy determinations
IE (eV) | Method | Reference | Comment |
---|---|---|---|
8.38 ± 0.02 | EI | Benezra and Bursey, 1972 | |
9.1 | PE | Meeks, Wahlborg, et al., 1981 | Vertical value |
Appearance energy determinations
Ion | AE (eV) | Other Products | Method | Reference | Comment |
---|---|---|---|---|---|
C7H7O+ | 13.16 ± 0.02 | CH3CO | EI | Benezra and Bursey, 1972 | |
C7H8O+ | 9.44 ± 0.02 | CH2=C=O | EI | Benezra and Bursey, 1972 |

Phase change data

Data compiled by: Robert L. Brown and Stephen E. Stein
Quantity | Value | Units | Method | Reference | Comment |
---|---|---|---|---|---|
Tboil | 481.2 | K | N/A | Weast and Grasselli, 1989 |

Normal alkane RI, polar column, custom temperature program

Data compiled by: NIST Mass Spectrometry Data Center, William E. Wallace, director

Column type Capillary
Active phase DB-Wax
Column length (m)
Carrier gas
Substrate
Column diameter (mm)
Phase thickness (μm)
Program not specified
I 1716.
ReferencePeng, Yang, et al., 1991
Comment MSDC-RI

References

Benezra and Bursey, 1972
Benezra, S.A.; Bursey, M.M.,
Hydrogen bonding in mass spectral activated complexes. A correction,
J. Chem. Soc. Perkin Trans. 2, 1972, 11, 1537. [all data]
Meeks, Wahlborg, et al., 1981
Meeks, J.; Wahlborg, A.; McGlynn, S.P.,
Photoelectron spectroscopy of carbonyls: Benzoic acid and its derivatives,
J. Electron Spectrosc. Relat. Phenom., 1981, 22, 43. [all data]