1,2,4,3,5-Triazadiborolidine,1-(dimethylphosphino)-2,3,4,5-tetramethyl-
- Formula: C6H18B2N3P
- Molecular weight: 184.823
- IUPAC Standard InChIKey: BUXQZFSOMALJRS-UHFFFAOYSA-N
- CAS Registry Number: 53246-20-1
- Chemical structure:
View 3d structure (requires JavaScript / HTML 5) - Permanent link for this species. Use this link for bookmarking this species for future reference.

Gas phase ion energetics data

Data compiled by: Sharon G. Lias, Rhoda D. Levin, and Sherif A. Kafafi
Ionization energy determinations
IE (eV) | Method | Reference | Comment |
---|---|---|---|
7.64 | PE | Kroner, Nolle, et al., 1975 | Vertical value |

References

Kroner, Nolle, et al., 1975
Kroner, J.; Nolle, D.; Noth, H.; Winterstein, W.,
Photoelektronenspektroskopische untersuchungen an bor-verbindungen, II funfgliedrige hetero - cyclen des bors,
Chem. Ber., 1975, 108, 3807. [all data]