1,2,4,3,5-Triazadiborolidine-3,5-diamine,N,N,N',N',1,2,4-heptamethyl-
- Formula: C7H21B2N5
- Molecular weight: 196.897
- IUPAC Standard InChIKey: APMXVOLBFKTGPX-UHFFFAOYSA-N
- CAS Registry Number: 53246-08-5
- Chemical structure:
View 3d structure (requires JavaScript / HTML 5) - Permanent link for this species. Use this link for bookmarking this species for future reference.

Gas phase ion energetics data

Data compiled by: Sharon G. Lias, Rhoda D. Levin, and Sherif A. Kafafi
Ionization energy determinations
IE (eV) | Method | Reference | Comment |
---|---|---|---|
7.05 | PE | Kroner, Nolle, et al., 1975 | Vertical value |

References

Kroner, Nolle, et al., 1975
Kroner, J.; Nolle, D.; Noth, H.; Winterstein, W.,
Photoelektronenspektroskopische untersuchungen an bor-verbindungen, II funfgliedrige hetero - cyclen des bors,
Chem. Ber., 1975, 108, 3807. [all data]