3H-1,2-Dithiole-3-thione, 5-(4-methoxyphenyl)-
- Formula: C10H8OS3
- Molecular weight: 240.365
- IUPAC Standard InChIKey: KYLIZBIRMBGUOP-UHFFFAOYSA-N
- CAS Registry Number: 532-11-6
- Chemical structure:

Phase change data

Data compiled by: William E. Acree, Jr., James S. Chickos
Enthalpy of fusion
ΔfusH (kJ/mol) | Temperature (K) | Method | Reference |
---|---|---|---|
24.39 | 382.2 | DSC | Dollo, Corre, et al., 1999 |

Gas phase ion energetics data

Data compiled by: Sharon G. Lias, Rhoda D. Levin, and Sherif A. Kafafi
Ionization energy determinations
IE (eV) | Method | Reference | Comment |
---|---|---|---|
8.11 | PE | Gonbeau, Guimon, et al., 1975 | Vertical value |

References

Dollo, Corre, et al., 1999
Dollo, Gilles; Corre, Pascal Le; Chollet, Marylene; Chevanne, Fran«65533»ois; Bertault, Marcel; Burgot, Jean-Louis; Verge, Roger Le,
Improvement in solubility and dissolution rate of 1,2-dithiole-3-thiones upon complexation with?-cyclodextrin and its hydroxypropyl and sulfobutyl ether-7 derivatives,
J. Pharm. Sci., 1999, 88, 9, 889-895, https://doi.org/10.1021/js990067o
. [all data]
Gonbeau, Guimon, et al., 1975
Gonbeau, D.; Guimon, C.; Deschamps, J.; Pfister-Guillouzo, G.,
Electronic structure of sulphur compounds IX. Photoelectron spectra of various 1,2-dithiole-3-thiones,
J. Electron Spectrosc. Relat. Phenom., 1975, 6, 99. [all data]