1,3,5-Cycloheptatriene-7-(2,4,6-cycloheptatrien-1-ylidene)-
- Formula: C14H12
- Molecular weight: 180.2451
- IUPAC Standard InChIKey: CJRANKZVJIECNW-UHFFFAOYSA-N
- CAS Registry Number: 531-45-3
- Chemical structure:
View 3d structure (requires JavaScript / HTML 5) - Permanent link for this species. Use this link for bookmarking this species for future reference.

Phase change data

Data compiled by: Thermodynamics Research Center, NIST Boulder Laboratories, Chris Muzny director
Quantity | Value | Units | Method | Reference | Comment |
---|---|---|---|---|---|
Tfus | 395. | K | N/A | Turner, Meador, et al., 1957 | Uncertainty assigned by TRC = 2. K |

Reaction thermochemistry data

Data compiled by: Hussein Y. Afeefy, Joel F. Liebman, and Stephen E. Stein
Individual Reactions
By formula: 6H2 + C14H12 = C14H24
Quantity | Value | Units | Method | Reference | Comment |
---|---|---|---|---|---|
ΔrH° | -547.14 ± 0.54 | kJ/mol | Chyd | Turner, Meador, et al., 1957, 2 | solid phase; solvent: Diethylcarbitol |

Gas phase ion energetics data

Data compiled by: Sharon G. Lias, Rhoda D. Levin, and Sherif A. Kafafi
Ionization energy determinations
IE (eV) | Method | Reference |
---|---|---|
7.0 ± 0.1 | EI | Klots, Compton, et al., 1974 |

References

Turner, Meador, et al., 1957
Turner, R.B.; Meador, W.R.; Doering, W. vonE.; Knox, L.H.; Mayer, J.R.; Wiley, D.W.,
Heats of Hydrogenation III. Hydrogenation of Cyclooctatetraene and of Some Seven-membered Non-benzenoid Aromatic Compounds,
J. Am. Chem. Soc., 1957, 79, 4127. [all data]
Turner, Meador, et al., 1957, 2
Turner, R.B.; Meador, W.R.; Doering, W.E.; Knox, L.H.; Mayer, J.R.; Wiley, D.W.,
Heats of hydrogenation. III. Hydrogenation of cycllooctatetraene and of some seven-membered non-benzenoid aromatic compounds,
J. Am. Chem. Soc., 1957, 79, 4127-4133. [all data]
Klots, Compton, et al., 1974
Klots, C.E.; Compton, R.N.; Raaen, V.F.,
Electronic and ionic properties of of molecular TTF and TCMQ,
J. Chem. Phys., 1974, 60, 1177. [all data]