Cyclopentanol,2-bromo-,acetate,trans-
- Formula: C7H11BrO2
- Molecular weight: 207.065
- IUPAC Standard InChIKey: RWFKZZAXUPSAQT-RNFRBKRXSA-N
- CAS Registry Number: 53093-42-8
- Chemical structure:
View 3d structure (requires JavaScript / HTML 5) - Stereoisomers:

Gas phase ion energetics data

Data compiled by: Sharon G. Lias, Rhoda D. Levin, and Sherif A. Kafafi
Ionization energy determinations
IE (eV) | Method | Reference |
---|---|---|
10.07 ± 0.02 | PE | Botter, Menes, et al., 1973 |

References

Botter, Menes, et al., 1973
Botter, R.; Menes, F.; Gounelle, Y.; Pechine, J.M.; Solgadi, D.,
The ionization potentials of geometrical isomers: the cis and trans 2-subststituted cyclopentyl and cyclohexyl bromides,
Int. J. Mass Spectrom. Ion Phys., 1973, 12, 188. [all data]