Dinaphtho[8,1,2-abc:2',1',8'-klm]coronene
- Formula: C36H16
- Molecular weight: 448.5122
- IUPAC Standard InChIKey: KETCSTBYNQMJQQ-UHFFFAOYSA-N
- CAS Registry Number: 53086-28-5
- Chemical structure:
View 3d structure (requires JavaScript / HTML 5) - Permanent link for this species. Use this link for bookmarking this species for future reference.

Gas phase ion energetics data

Data compiled as indicated in comments:
LLK - Sharon G. Lias, Rhoda D. Levin, and Sherif A. Kafafi
Ionization energy determinations
IE (eV) | Method | Reference | Comment |
---|---|---|---|
6.85 ± 0.04 | PE | Boschi, Clar, et al., 1974 | LLK |
6.76 ± 0.02 | PE | Clar and Schmidt, 1978 | Vertical value; LLK |

References

Boschi, Clar, et al., 1974
Boschi, R.; Clar, E.; Schmidt, W.,
Photoelectron spectra of polynuclear aromatics. III. The effect of nonplanarity in sterically overcrowded aromatic hydrocarbons,
J. Chem. Phys., 1974, 60, 4406. [all data]
Clar and Schmidt, 1978
Clar, E.; Schmidt, W.,
Correlations between photoelectron and ultravioet absorption spectra of polycyclic hydrocarbons. The terrylene and peropyrene series,
Tetrahedron, 1978, 34, 3219. [all data]