Ethylene, 1,1-diphenyl-
- Formula: C14H12
- Molecular weight: 180.2451
- IUPAC Standard InChIKey: ZMYIIHDQURVDRB-UHFFFAOYSA-N
- CAS Registry Number: 530-48-3
- Chemical structure:
View 3d structure (requires JavaScript / HTML 5) - Other names: Benzene, 1,1'-ethenylidenebis-; α-Methylene-diphenylmethane; α-Phenylstyrene; α,α-Diphenylethylene; 1,1-Diphenylethene; 1,1-Diphenylethylene; as-Diphenylethylene; unsym-Diphenylethylene; NSC 57645; diphenylethylene

Condensed phase thermochemistry data

Data compiled as indicated in comments:
ALS - Hussein Y. Afeefy, Joel F. Liebman, and Stephen E. Stein
DH - Eugene S. Domalski and Elizabeth D. Hearing
Quantity | Value | Units | Method | Reference | Comment |
---|---|---|---|---|---|
ΔcH°liquid | -7396.5 ± 1.2 | kJ/mol | Ccb | Coops and Hoijtink, 1950 | Reanalyzed by Cox and Pilcher, 1970, Original value = -7393.0 ± 0.59 kJ/mol; Corresponding ΔfHºliquid = 172.38 kJ/mol (simple calculation by NIST; no Washburn corrections); ALS |
Constant pressure heat capacity of liquid
Cp,liquid (J/mol*K) | Temperature (K) | Reference | Comment |
---|---|---|---|
299.2 | 298.5 | Smith and Andrews, 1931 | T = 102 to 299 K. Value is unsmoothed experimental datum.; DH |

Phase change data

Data compiled as indicated in comments:
BS - Robert L. Brown and Stephen E. Stein
TRC - Thermodynamics Research Center, NIST Boulder Laboratories, Chris Muzny director
AC - William E. Acree, Jr., James S. Chickos
ALS - Hussein Y. Afeefy, Joel F. Liebman, and Stephen E. Stein
Quantity | Value | Units | Method | Reference | Comment |
---|---|---|---|---|---|
Tboil | 543.7 | K | N/A | Aldrich Chemical Company Inc., 1990 | BS |
Tboil | 550.2 | K | N/A | Weast and Grasselli, 1989 | BS |
Quantity | Value | Units | Method | Reference | Comment |
Tfus | 281. | K | N/A | Welsh and Drake, 1938 | Uncertainty assigned by TRC = 4. K; TRC |
Tfus | 281.35 | K | N/A | Smith and Andrews, 1931, 2 | Uncertainty assigned by TRC = 0.3 K; freezzing pt. by thermocouple; TRC |
Quantity | Value | Units | Method | Reference | Comment |
ΔvapH° | 71.2 ± 0.7 | kJ/mol | GS | Verevkin and Ebenhoch, 1999 | Based on data from 298. to 331. K.; AC |
Enthalpy of vaporization
ΔvapH (kJ/mol) | Temperature (K) | Method | Reference | Comment |
---|---|---|---|---|
70.2 ± 0.7 | 314. | GS | Verevkin and Ebenhoch, 1999 | Based on data from 298. to 331. K.; AC |
59.3 | 375. | A | Stephenson and Malanowski, 1987 | Based on data from 360. to 550. K. See also Stull, 1947.; AC |
73.30 | 512. | V | Holmes and Tyrrall, 1956 | ALS |
Antoine Equation Parameters
log10(P) = A − (B / (T + C))
P = vapor pressure (bar)
T = temperature (K)
View plot Requires a JavaScript / HTML 5 canvas capable browser.
Temperature (K) | A | B | C | Reference | Comment |
---|---|---|---|---|---|
360.6 to 550. | 4.85805 | 2470.113 | -41.253 | Stull, 1947 | Coefficents calculated by NIST from author's data. |

Gas phase ion energetics data

Data evaluated as indicated in comments:
HL - Edward P. Hunter and Sharon G. Lias
Data compiled as indicated in comments:
LLK - Sharon G. Lias, Rhoda D. Levin, and Sherif A. Kafafi
B - John E. Bartmess
Quantity | Value | Units | Method | Reference | Comment |
---|---|---|---|---|---|
Proton affinity (review) | 885.7 | kJ/mol | N/A | Hunter and Lias, 1998 | HL |
Quantity | Value | Units | Method | Reference | Comment |
Gas basicity | 856.9 | kJ/mol | N/A | Hunter and Lias, 1998 | HL |
Electron affinity determinations
EA (eV) | Method | Reference | Comment |
---|---|---|---|
<0.390 ± 0.061 | ECD | Wojnarovits and Foldiak, 1981 | EA is an upper limit: Chen and Wentworth, 1989. G3MP2B3 calculations indicate an EA of ca. -0.05 eV, unbound anion; B |
Ionization energy determinations
IE (eV) | Method | Reference | Comment |
---|---|---|---|
8.00 ± 0.02 | PE | Maier and Turner, 1973 | LLK |

Lee's RI, non-polar column, temperature ramp

Column type | Active phase | I | Reference | Comment |
---|---|---|---|---|
Capillary | HP-5 | 296.62 | Piao, Chu, et al., 1999 | 30. m/0.25 mm/0.25 μm, 50. C @ 2. min, 4. K/min, 280. C @ 20. min |
Capillary | HP-5 | 289.70 | Piao, Chu, et al., 1999 | 30. m/0.25 mm/0.25 μm, 50. C @ 2. min, 4. K/min, 280. C @ 20. min |

References

Coops and Hoijtink, 1950
Coops, J.; Hoijtink, G.J.,
Thermochemical investigations on arylethenes. I. Heats of combustion of phenylethenes,
Recl. Trav. Chim. Pays-Bas, 1950, 69, 358-367. [all data]
Cox and Pilcher, 1970
Cox, J.D.; Pilcher, G.,
Thermochemistry of Organic and Organometallic Compounds, Academic Press, New York, 1970, 1-636. [all data]
Smith and Andrews, 1931
Smith, R.H.; Andrews, D.H.,
Thermal energy studies. I. Phenyl derivatives of methane,
ethane and some related compounds. J. Am. Chem. Soc., 1931, 53, 3644-3660. [all data]
Aldrich Chemical Company Inc., 1990
Aldrich Chemical Company Inc.,
Catalog Handbook of Fine Chemicals, Aldrich Chemical Company, Inc., Milwaukee WI, 1990, 1. [all data]
Weast and Grasselli, 1989
CRC Handbook of Data on Organic Compounds, 2nd Editon, Weast,R.C and Grasselli, J.G., ed(s)., CRC Press, Inc., Boca Raton, FL, 1989, 1. [all data]
Welsh and Drake, 1938
Welsh, L.H.; Drake, N.L.,
The Condensation of Tertiary Aryl Substituted Carbinos with Phenol in the Presence of Aluminum Chloride,
J. Am. Chem. Soc., 1938, 60, 59. [all data]
Smith and Andrews, 1931, 2
Smith, R.H.; Andrews, D.H.,
Thermal Energy Studies I. Phenyl Derivatives of Methane, Ethane and Some Related Compounds,
J. Am. Chem. Soc., 1931, 53, 3644. [all data]
Verevkin and Ebenhoch, 1999
Verevkin, Sergey P.; Ebenhoch, Jochen,
Structural Chemistry, 1999, 10, 6, 401-409, https://doi.org/10.1023/A:1022470804409
. [all data]
Stephenson and Malanowski, 1987
Stephenson, Richard M.; Malanowski, Stanislaw,
Handbook of the Thermodynamics of Organic Compounds, 1987, https://doi.org/10.1007/978-94-009-3173-2
. [all data]
Stull, 1947
Stull, Daniel R.,
Vapor Pressure of Pure Substances. Organic and Inorganic Compounds,
Ind. Eng. Chem., 1947, 39, 4, 517-540, https://doi.org/10.1021/ie50448a022
. [all data]
Holmes and Tyrrall, 1956
Holmes, W.S.; Tyrrall, E.,
Entropy of vaporization and molecular rotation in the liquid state,
Chem. Ind. (London), 1956, 662-663. [all data]
Hunter and Lias, 1998
Hunter, E.P.; Lias, S.G.,
Evaluated Gas Phase Basicities and Proton Affinities of Molecules: An Update,
J. Phys. Chem. Ref. Data, 1998, 27, 3, 413-656, https://doi.org/10.1063/1.556018
. [all data]
Wojnarovits and Foldiak, 1981
Wojnarovits, L.; Foldiak, G.,
Electron capture detection of aromatic hydrocarbons,
J. Chromatogr. Sci., 1981, 206, 511. [all data]
Chen and Wentworth, 1989
Chen, E.C.M.; Wentworth, W.E.,
Experimental Determination of Electron Affinities of Organic Molecules,
Mol. Cryst. Liq. Cryst., 1989, 171, 271. [all data]
Maier and Turner, 1973
Maier, J.P.; Turner, D.W.,
Steric inhibition of resonance studied by molecular photoelectron spectroscopy. Part 2. Phenylethylenes,
J. Chem. Soc. Faraday Trans. 2, 1973, 69, 196. [all data]
Curtin and Hendrickon, 1956
Curtin, D.Y.; Hendrickon, Y.G.,
J. Org. Chem., 1956, 21, 1260. [all data]
Piao, Chu, et al., 1999
Piao, M.; Chu, S.; Zheng, M.; Xu, X.,
Characterization of the combustion products of polyethylene,
Chemosphere, 1999, 39, 9, 1497-1512, https://doi.org/10.1016/S0045-6535(99)00054-5
. [all data]