Methanone, [4-(dimethylamino)phenyl]phenyl-
- Formula: C15H15NO
- Molecular weight: 225.2857
- IUPAC Standard InChIKey: BEUGBYXJXMVRFO-UHFFFAOYSA-N
- CAS Registry Number: 530-44-9
- Chemical structure:
View 3d structure (requires JavaScript / HTML 5) - Other names: Benzophenone, 4-(dimethylamino)-; p-Benzoyl-N,N-dimethylaniline; p-Dimethylaminobenzophenone; 4-(Dimethylamino)benzophenone; 4-N,N-Dimethylaminobenzophenone; Benzenamine,N,N-dimethyl-4-(phenylmethanone)-

Gas phase ion energetics data

Data compiled by: Sharon G. Lias, Rhoda D. Levin, and Sherif A. Kafafi
Ionization energy determinations
IE (eV) | Method | Reference |
---|---|---|
7.50 ± 0.05 | PI | Potapov, Kardash, et al., 1972 |

References

Potapov, Kardash, et al., 1972
Potapov, V.K.; Kardash, I.E.; Sorokin, V.V.; Sokolov, S.A.; Evlasheva, T.I.,
Photoionization of heteroaromatic compounds,
Khim. Vys. Energ., 1972, 6, 392. [all data]
Feichtmayer, 1966
Feichtmayer, W.,
UV atlas of organic compounds, 1966, 2, D11/14. [all data]