Butanoic acid, 2-ethyl-2-methyl-, methyl ester
- Formula: C8H16O2
- Molecular weight: 144.2114
- IUPAC Standard InChIKey: RUFXPLNQCKJCCF-UHFFFAOYSA-N
- CAS Registry Number: 5296-70-8
- Chemical structure:
View 3d structure (requires JavaScript / HTML 5) - Other names: Butyric acid, 2-ethyl-2-methyl-, methyl ester; Methyl α-ethyl-α-methylbutyrate; Methyl α-methyl-α-ethylbutyrate

Kovats' RI, non-polar column, isothermal

Column type | Active phase | Temperature (C) | I | Reference | Comment |
---|---|---|---|---|---|
Packed | Squalane | 120. | 869. | Schomburg, 1964 |

References

Schomburg, 1964
Schomburg, G.,
Gas-Chromatographische Retentionsdaten und Struktur Chemischer Verbindungen. I. Verzweigte Aliphatische und Alicyclische Carbonsäure-Methylester,
J. Chromatogr., 1964, 14, 157-177, https://doi.org/10.1016/S0021-9673(00)86608-X
. [all data]