3-Ethylthio-1-propene
- Formula: C5H10S
- Molecular weight: 102.198
- IUPAC Standard InChIKey: NOJXPGXFDASWEI-UHFFFAOYSA-N
- CAS Registry Number: 5296-62-8
- Chemical structure:
View 3d structure (requires JavaScript / HTML 5) - Other names: CH2=CHCH2SC2H5; Allyl ethyl sulfide; Allyl ethyl sulphide; 4-Thia-1-hexene

Gas phase thermochemistry data

Data compiled by: Hussein Y. Afeefy, Joel F. Liebman, and Stephen E. Stein
Quantity | Value | Units | Method | Reference | Comment |
---|---|---|---|---|---|
ΔfH°gas | 18. ± 3. | kJ/mol | Ccb | Mackle and Mayrick, 1962 |

Condensed phase thermochemistry data

Data compiled by: Hussein Y. Afeefy, Joel F. Liebman, and Stephen E. Stein
Quantity | Value | Units | Method | Reference | Comment |
---|---|---|---|---|---|
ΔfH°liquid | -21. ± 3. | kJ/mol | Ccb | Mackle and Mayrick, 1962 | |
Quantity | Value | Units | Method | Reference | Comment |
ΔcH°liquid | -3977.4 ± 1.9 | kJ/mol | Ccb | Mackle and Mayrick, 1962 |

Phase change data

Data compiled as indicated in comments:
AC - William E. Acree, Jr., James S. Chickos
ALS - Hussein Y. Afeefy, Joel F. Liebman, and Stephen E. Stein
DRB - Donald R. Burgess, Jr.
Quantity | Value | Units | Method | Reference | Comment |
---|---|---|---|---|---|
ΔvapH° | 39.3 | kJ/mol | N/A | Mackle and Mayrick, 1962, 2 | Based on data from 300. to 327. K.; AC |
ΔvapH° | 39. ± 1. | kJ/mol | C | Mackle and Mayrick, 1962 | ALS |
ΔvapH° | 39.0 | kJ/mol | N/A | Mackle and Mayrick, 1962 | DRB |
Enthalpy of vaporization
ΔvapH (kJ/mol) | Temperature (K) | Method | Reference | Comment |
---|---|---|---|---|
38.9 | 313. | A,EB | Stephenson and Malanowski, 1987 | Based on data from 300. to 327. K. See also Mackle and Mayrick, 1962, 2 and Dykyj, Svoboda, et al., 1999.; AC |

Reaction thermochemistry data

Data compiled by: Hussein Y. Afeefy, Joel F. Liebman, and Stephen E. Stein
Individual Reactions
By formula: C5H10S = C5H10S
Quantity | Value | Units | Method | Reference | Comment |
---|---|---|---|---|---|
ΔrH° | -11.8 ± 1.0 | kJ/mol | Eqk | Kimmelma, 1988 | liquid phase; solvent: DMSO; NMR |

Gas phase ion energetics data

Data compiled as indicated in comments:
LLK - Sharon G. Lias, Rhoda D. Levin, and Sherif A. Kafafi
Ionization energy determinations
IE (eV) | Method | Reference | Comment |
---|---|---|---|
8.51 ± 0.01 | PI | Trofimov, Mel'der, et al., 1975 | LLK |

Kovats' RI, non-polar column, isothermal

Column type | Active phase | Temperature (C) | I | Reference | Comment |
---|---|---|---|---|---|
Packed | Apiezon M | 130. | 777. | Garbuzov, Misharina, et al., 1985 | He or N2, Chromosorb W, AW-DMCS; Column length: 2.1 m |
Packed | Apiezon M | 130. | 777. | Golovnya, Misharina, et al., 1978 | Chromosorb W, AW-DMCS; Column length: 2.1 m |

References

Mackle and Mayrick, 1962
Mackle, H.; Mayrick, R.G.,
Studies in thermochemistry of organic sulphides. Part 3.-The gas-phase heats of formation of diphenyl sulphide, dibenzyl sulphide, diphenyl disulphide,4-thia-1-hexene and 4-thia-5,5-dimethyl-1-hexene,
Trans. Faraday Soc., 1962, 58, 238-243. [all data]
Mackle and Mayrick, 1962, 2
Mackle, H.; Mayrick, R.G.,
Studies in the thermochemistry of organic sulphides. Part 3.?The gas-phase heats of formation of diphenyl sulphide, dibenzyl sulphide, diphenyl disulphide, 4-thia-1-hexene and 4-thia-5,5-dimethyl-1-hexene,
Trans. Faraday Soc., 1962, 58, 238, https://doi.org/10.1039/tf9625800238
. [all data]
Stephenson and Malanowski, 1987
Stephenson, Richard M.; Malanowski, Stanislaw,
Handbook of the Thermodynamics of Organic Compounds, 1987, https://doi.org/10.1007/978-94-009-3173-2
. [all data]
Dykyj, Svoboda, et al., 1999
Dykyj, J.; Svoboda, J.; Wilhoit, R.C.; Frenkel, M.L.; Hall, K.R.,
Vapor Pressure of Chemicals: Part A. Vapor Pressure and Antoine Constants for Hydrocarbons and Sulfur, Selenium, Tellurium and Hydrogen Containing Organic Compounds, Springer, Berlin, 1999, 373. [all data]
Kimmelma, 1988
Kimmelma, R.,
Structure-stability relationships in vinyl sulfides. III. Stabilization caused by different alkylthio and phenylthio groups attached to an olefinic double bond,
Acta Chem. Scand., 1988, 42, 550-555. [all data]
Trofimov, Mel'der, et al., 1975
Trofimov, B.A.; Mel'der, U.K.; Pikver, R.I.; Vyalykh, E.P.,
Ionization potentials of unsaturated and sulfides the participation of neighboring multiple bonds of heteroatoms in the stabilization of the radical cation,
Teor. Eksp. Khim., 1975, 11, 129. [all data]
Garbuzov, Misharina, et al., 1985
Garbuzov, V.G.; Misharina, T.A.; Aerov, A.F.; Golovnya, R.V.,
Gas chromatographic retention indices for sulphur(II)-containing organic substances,
J. Anal. Chem. USSR (Engl. Transl.), 1985, 40, 4, 576-586. [all data]
Golovnya, Misharina, et al., 1978
Golovnya, R.V.; Misharina, T.A.; Garbuzov, V.G.,
Gas chromatographic characterization of sulfur-containing compounds. 4. The effect of unsaturated radicals on the retention indices of the vinyl, allyl, and propargyl alkyl sulfides,
Izv. Akad. Nauk SSSR Ser. Khim., 1978, 11, 2266-2270. [all data]