7,8-Dioxabicyclo[4.2.2]decane
- Formula: C8H14O2
- Molecular weight: 142.1956
- IUPAC Standard InChIKey: GRPFSWFCSGHVIB-UHFFFAOYSA-N
- CAS Registry Number: 52965-57-8
- Chemical structure:
View 3d structure (requires JavaScript / HTML 5) - Other names: 7,8-Dioxabicyclo(4,2,2)decane

Gas phase ion energetics data

Data compiled by: Sharon G. Lias, Rhoda D. Levin, and Sherif A. Kafafi
Ionization energy determinations
IE (eV) | Method | Reference | Comment |
---|---|---|---|
9.06 | PE | Gleiter, Schang, et al., 1980 | Vertical value |
9.05 | PE | Coughlin, Brown, et al., 1979 | Vertical value |

References

Gleiter, Schang, et al., 1980
Gleiter, R.; Schang, P.; Adam, W.; Eggelte, H.J.; Erden, I.; Bloodworth, A.J.,
Photoelectron spectra of bicyclic peroxides,
J. Electron Spectrosc. Relat. Phenom., 1980, 19, 223. [all data]
Coughlin, Brown, et al., 1979
Coughlin, D.J.; Brown, R.S.; Salomon, R.G.,
The prostaglandin endoperoxide nucleus and related bicyclic peroxides. Synthetic and spectroscopic studies,
J. Am. Chem. Soc., 1979, 101, 1533. [all data]