Cyclopentene,4,4-dichloro-
- Formula: C5H6Cl2
- Molecular weight: 137.007
- IUPAC Standard InChIKey: GVZSEVSNGREDBC-UHFFFAOYSA-N
- CAS Registry Number: 5296-48-0
- Chemical structure:
View 3d structure (requires JavaScript / HTML 5) - Permanent link for this species. Use this link for bookmarking this species for future reference.

Gas phase ion energetics data

Data compiled by: Sharon G. Lias, Rhoda D. Levin, and Sherif A. Kafafi
Ionization energy determinations
IE (eV) | Method | Reference | Comment |
---|---|---|---|
9.78 | PE | Bertoti, Cradock, et al., 1976 | Vertical value |

References

Bertoti, Cradock, et al., 1976
Bertoti, I.; Cradock, S.; Ebsworth, E.A.V.; Whiteford, R.A.,
Photoelectron spectra and transannular interactions in 1-silacyclopent-3-enes,
J. Chem. Soc. Dalton Trans., 1976, 937. [all data]