1-Naphthalenol, 1,2,3,4-tetrahydro-
- Formula: C10H12O
- Molecular weight: 148.2017
- IUPAC Standard InChIKey: JAAJQSRLGAYGKZ-UHFFFAOYSA-N
- CAS Registry Number: 529-33-9
- Chemical structure:
View 3d structure (requires JavaScript / HTML 5) - Species with the same structure:
- Other names: 1-Naphthol, 1,2,3,4-tetrahydro-; α-Tetralol; Tetrahydro-1-naphthol; Tetralin-1-ol; 1-Tetralol; 1,2,3,4-Tetrahydro-1-naphthol; 1,2,3,4-Tetrahydro-α-naphthol; 1,2,3,4-Tetrahydro-1-naphthalenol; 1-Hydroxytetralin; NSC 5172; 1,2,3,4-tetrahydronaphthalen-1-ol

Condensed phase thermochemistry data

Data compiled by: Hussein Y. Afeefy, Joel F. Liebman, and Stephen E. Stein
Quantity | Value | Units | Method | Reference | Comment |
---|---|---|---|---|---|
ΔcH°solid | -5408.7 | kJ/mol | Ccb | Hock and Knauel, 1951 | Corresponding ΔfHºsolid = -241. kJ/mol (simple calculation by NIST; no Washburn corrections) |

Phase change data

Data compiled by: Robert L. Brown and Stephen E. Stein
Reduced pressure boiling point
Tboil (K) | Pressure (bar) | Reference |
---|---|---|
376.2 | 0.003 | Weast and Grasselli, 1989 |

Gas phase ion energetics data

Data compiled by: Sharon G. Lias, Rhoda D. Levin, and Sherif A. Kafafi
Ionization energy determinations
IE (eV) | Method | Reference |
---|---|---|
8.70 ± 0.01 | EI | Gross, Chiu, et al., 1977 |
Appearance energy determinations
Ion | AE (eV) | Other Products | Method | Reference | Comment |
---|---|---|---|---|---|
C8H8O+ | 10.42 ± 0.03 | C2H4 | EI | Gross, Chiu, et al., 1977 | |
C10H10+ | 8.87 ± 0.07 | H2O | EI | Gross, Chiu, et al., 1977 | |
C10H11O+ | 9.67 ± 0.11 | H | EI | Gross, Chiu, et al., 1977 |

References

Hock and Knauel, 1951
Hock, I.H.; Knauel, G.,
Autoxydation von kohlenwasserstoffen, XIV. Mitteil. Uber die energetische stellung organischer hydroperoxyde,
Chem. Ber., 1951, 84, 1-5. [all data]
Weast and Grasselli, 1989
CRC Handbook of Data on Organic Compounds, 2nd Editon, Weast,R.C and Grasselli, J.G., ed(s)., CRC Press, Inc., Boca Raton, FL, 1989, 1. [all data]
Gross, Chiu, et al., 1977
Gross, M.L.; Chiu, E.; Pokorny, D.; DeRoos, F.L.,
Regiospecificity for water elimination. A mass spectral study of 1-tetralol and 2-tetralol,
Org. Mass Spectrom., 1977, 12, 55. [all data]