Benzonitrile, 2-methyl-
- Formula: C8H7N
- Molecular weight: 117.1479
- IUPAC Standard InChIKey: NWPNXBQSRGKSJB-UHFFFAOYSA-N
- CAS Registry Number: 529-19-1
- Chemical structure:
View 3d structure (requires JavaScript / HTML 5) - Other names: o-Tolunitrile; o-Cyanotoluene; o-Methylbenzonitrile; o-Toluonitrile; o-Tolylnitrile; 2-Cyanotoluene; 2-Methylbenzenecarbonitrile; 2-Methylbenzonitrile; 2-Tolunitrile; o-Toluic nitrile; 1-Methyl-2-cyanobenzene; 2-Toluenkarbonitril; 1-Cyano-2-methylbenzene; NSC 66549

Phase change data

Data compiled as indicated in comments:
BS - Robert L. Brown and Stephen E. Stein
TRC - Thermodynamics Research Center, NIST Boulder Laboratories, Chris Muzny director
Quantity | Value | Units | Method | Reference | Comment |
---|---|---|---|---|---|
Tboil | 478.2 | K | N/A | Weast and Grasselli, 1989 | BS |
Tboil | 477.9 | K | N/A | Wright, 1961 | Uncertainty assigned by TRC = 0.6 K; TRC |
Tboil | 478. | K | N/A | Wright, 1960 | Uncertainty assigned by TRC = 0.5 K; TRC |
Tboil | 478.35 | K | N/A | Perkin, 1896 | Uncertainty assigned by TRC = 1. K; TRC |
Quantity | Value | Units | Method | Reference | Comment |
Tfus | 262.53 | K | N/A | Witschonke, 1954 | Crystal phase 1 phase; Uncertainty assigned by TRC = 0.3 K; TRC |
Tfus | 262.75 | K | N/A | Witschonke, 1954 | Crystal phase 1 phase; Uncertainty assigned by TRC = 0.25 K; TRC |
Tfus | 260.9 | K | N/A | Witschonke, 1954 | Metastable crystal phase; Uncertainty assigned by TRC = 0.35 K; TRC |
Tfus | 261.1 | K | N/A | Witschonke, 1954 | Metastable crystal phase; Uncertainty assigned by TRC = 0.02 K; TRC |

Gas phase ion energetics data

Data compiled by: Sharon G. Lias, Rhoda D. Levin, and Sherif A. Kafafi
Ionization energy determinations
IE (eV) | Method | Reference | Comment |
---|---|---|---|
9.40 | PE | Palmer, Moyes, et al., 1980 | Vertical value |
9.38 | PE | Kobayashi and Nagakura, 1974 | Vertical value |

Van Den Dool and Kratz RI, polar column, temperature ramp

Column type | Active phase | I | Reference | Comment |
---|---|---|---|---|
Capillary | DB-Wax | 1912. | Shimoda, Shigematsu, et al., 1995 | 60. m/0.25 mm/0.25 μm, 2. K/min; Tstart: 50. C; Tend: 230. C |
Capillary | DB-Wax | 1912. | Shimoda, Shigematsu, et al., 1995, 2 | 60. m/0.25 mm/0.25 μm, He, 2. K/min; Tstart: 50. C; Tend: 230. C |

Lee's RI, non-polar column, temperature ramp

Column type | Active phase | I | Reference | Comment |
---|---|---|---|---|
Capillary | HP-5 | 172.6 | Shao, Wang, et al., 2006 | 30. m/0.3 mm/0.25 μm, He, 50. C @ 5. min, 5. K/min, 200. C @ 15. min |

References

Weast and Grasselli, 1989
CRC Handbook of Data on Organic Compounds, 2nd Editon, Weast,R.C and Grasselli, J.G., ed(s)., CRC Press, Inc., Boca Raton, FL, 1989, 1. [all data]
Wright, 1961
Wright, F.J.,
Influence of temperature on viscosity of nonassociated liquids,
J. Chem. Eng. Data, 1961, 6, 454. [all data]
Wright, 1960
Wright, F.J.,
Latent Heat of Vaporization and Composition,
Recl. Trav. Chim. Pays-Bas, 1960, 79, 784-9. [all data]
Perkin, 1896
Perkin, W.H.,
LXIX. On Magnetic Rotatory Power, especially of Aromatic Compounds,
J. Chem. Soc., 1896, 69, 1025-1257. [all data]
Witschonke, 1954
Witschonke, C.R.,
Freezing point and purity data for some organic compounds,
Anal. Chem., 1954, 26, 562-4. [all data]
Palmer, Moyes, et al., 1980
Palmer, M.H.; Moyes, W.; Spiers, M.,
The electronic structure of substituted benzenes: Ab initio calculations and photoelectron spectra for benzonitrile, the tolunitriles, fluorobenzonitriles, dicyanobenzenes and ethynylbenzene,
J. Mol. Struct., 1980, 62, 165. [all data]
Kobayashi and Nagakura, 1974
Kobayashi, T.; Nagakura, S.,
Photoelectron spectra of substituted benzenes,
Bull. Chem. Soc. Jpn., 1974, 47, 2563. [all data]
Bol'shakov, et al., 1969
Bol'shakov, G.F., et al.,
Ultraviolet spectra of heteroorganic compounds, 1969, 175. [all data]
Shimoda, Shigematsu, et al., 1995
Shimoda, M.; Shigematsu, H.; Shiratsuchi, H.; Osajima, Y.,
Comparison of the odor concentrates by SDE and adsorptive column method from green tea infusion,
J. Agric. Food Chem., 1995, 43, 6, 1616-1620, https://doi.org/10.1021/jf00054a037
. [all data]
Shimoda, Shigematsu, et al., 1995, 2
Shimoda, M.; Shigematsu, H.; Shiratsuchi, H.; Osajima, Y.,
Comparison of volatile compounds among different grades of green tea and their relations to odor attributes,
J. Agric. Food Chem., 1995, 43, 6, 1621-1625, https://doi.org/10.1021/jf00054a038
. [all data]
Shao, Wang, et al., 2006
Shao, X.; Wang, G.; Sun, Y.; Zhang, R.; Xie, K.; Liu, H.,
Determination and Characterization of the Pyrolysis Products of Isoprocarb by GC-MS,
J. Chromatogr. Sci., 2006, 44, 3, 141-147, https://doi.org/10.1093/chromsci/44.3.141
. [all data]