3,4-Dimethylenecyclobut-1-ene
- Formula: C6H6
- Molecular weight: 78.1118
- IUPAC Standard InChIKey: WHCRVRGGFVUMOK-UHFFFAOYSA-N
- CAS Registry Number: 5291-90-7
- Chemical structure:
View 3d structure (requires JavaScript / HTML 5) - Permanent link for this species. Use this link for bookmarking this species for future reference.

Gas phase thermochemistry data

Data compiled by: Hussein Y. Afeefy, Joel F. Liebman, and Stephen E. Stein
Quantity | Value | Units | Method | Reference | Comment |
---|---|---|---|---|---|
ΔfH°gas | 336. | kJ/mol | Chyd | Roth, Lennartz, et al., 1986 | Mixture cis and trans |

Phase change data

Data compiled by: Robert L. Brown and Stephen E. Stein
Quantity | Value | Units | Method | Reference | Comment |
---|---|---|---|---|---|
Tboil | 345. | K | N/A | Buckingham and Donaghy, 1982 |

Reaction thermochemistry data

Data compiled by: Hussein Y. Afeefy, Joel F. Liebman, and Stephen E. Stein
Individual Reactions
By formula: 3H2 + C6H6 = C6H12
Quantity | Value | Units | Method | Reference | Comment |
---|---|---|---|---|---|
ΔrH° | -376. ± 1. | kJ/mol | Chyd | Roth, Lennartz, et al., 1986 | liquid phase; solvent: Isooctane; Mixture cis and trans |

Gas phase ion energetics data

Data compiled as indicated in comments:
LLK - Sharon G. Lias, Rhoda D. Levin, and Sherif A. Kafafi
Ionization energy determinations
IE (eV) | Method | Reference | Comment |
---|---|---|---|
8.80 ± 0.02 | PE | Bieri, Burger, et al., 1977 | LLK |
8.80 | PE | Heilbronner, Gleiter, et al., 1971 | LLK |

References

Roth, Lennartz, et al., 1986
Roth, W.E.; Lennartz, H.W.; Vogel, E.; Leiendecker, M.; Masaji, O.,
Heats of hydrogenation. 6. Resonance energy of fused [4n]annulenes,
Chem. Ber., 1986, 119, 837-843. [all data]
Buckingham and Donaghy, 1982
Buckingham, J.; Donaghy, S.M.,
Dictionary of Organic Compounds: Fifth Edition, Chapman and Hall, New York, 1982, 1. [all data]
Bieri, Burger, et al., 1977
Bieri, G.; Burger, F.; Heilbronner, E.; Maier, J.P.,
Valence ionization enrgies of hydrocarbons,
Helv. Chim. Acta, 1977, 60, 2213. [all data]
Heilbronner, Gleiter, et al., 1971
Heilbronner, E.; Gleiter, R.; Hopf, H.; Homung, V.; deMeijere, A.,
Photoelectron-spectroscopic evidence for the orbital sequence in fulvene and 3,4-dimethylenecyclobutene,
Helv. Chim. Acta, 1971, 54, 783. [all data]