3-Butenyl, 2-methyl-
- Formula: C5H9
- Molecular weight: 69.1250
- IUPAC Standard InChIKey: VLBIFNCUKNKYMD-UHFFFAOYSA-N
- CAS Registry Number: 52898-42-7
- Chemical structure:
View 3d structure (requires JavaScript / HTML 5) - Permanent link for this species. Use this link for bookmarking this species for future reference.

Gas phase ion energetics data

Data compiled by: Sharon G. Lias, Rhoda D. Levin, and Sherif A. Kafafi
Ionization energy determinations
IE (eV) | Method | Reference |
---|---|---|
8.0 | DER | Lossing and Traeger, 1975 |

References

Lossing and Traeger, 1975
Lossing, F.P.; Traeger, J.C.,
Free radicals by mass spectrometry XLVI. Heats of formation of C5H7 and C5H9 radicals and cations.,
J. Am. Chem. Soc., 1975, 19, 9. [all data]