Benzene,1,1'-thiobis[2,6-dimethyl-
- Formula: C16H18S
- Molecular weight: 242.379
- IUPAC Standard InChIKey: JLGIRMVCNXRIMN-UHFFFAOYSA-N
- CAS Registry Number: 52805-90-0
- Chemical structure:
View 3d structure (requires JavaScript / HTML 5) - Permanent link for this species. Use this link for bookmarking this species for future reference.

Gas phase ion energetics data

Data compiled by: Sharon G. Lias, Rhoda D. Levin, and Sherif A. Kafafi
Ionization energy determinations
IE (eV) | Method | Reference |
---|---|---|
8.36 | CTS | Aloisi, Santini, et al., 1974 |

References

Aloisi, Santini, et al., 1974
Aloisi, G.G.; Santini, S.; Sorriso, S.,
Molecular complexes of substituted diphenyl sulphides with π acceptors. Charge transfer spectra and ionization potentials of the donors,
J. Chem. Soc. Faraday Trans. 1, 1974, 70, 1908. [all data]