2-Furancarbonyl chloride
- Formula: C5H3ClO2
- Molecular weight: 130.529
- IUPAC Standard InChIKey: OFTKFKYVSBNYEC-UHFFFAOYSA-N
- CAS Registry Number: 527-69-5
- Chemical structure:
View 3d structure (requires JavaScript / HTML 5) - Other names: 2-Furoyl chloride; α-Furoic chloride; Furan-2-carbonyl chloride; Furan, 2-(chloroformyl)-; Pyromucyl chloride; 2-(Chloroformyl)furan; 2-Chlorocarbonylfuran; 2-Furancarboxylic acid chloride

Phase change data

Data compiled by: Robert L. Brown and Stephen E. Stein
Quantity | Value | Units | Method | Reference | Comment |
---|---|---|---|---|---|
Tboil | 446.2 | K | N/A | Weast and Grasselli, 1989 |
Reduced pressure boiling point
Tboil (K) | Pressure (bar) | Reference |
---|---|---|
339.2 | 0.013 | Weast and Grasselli, 1989 |

Gas phase ion energetics data

Data compiled by: Sharon G. Lias and Joel F. Liebman
Ionization energy determinations
IE (eV) | Method | Reference | Comment |
---|---|---|---|
9.44 | PE | Klapstein, MacPherson, et al., 1990 | |
9.56 | PE | Klapstein, MacPherson, et al., 1990 | Vertical value |

References

Weast and Grasselli, 1989
CRC Handbook of Data on Organic Compounds, 2nd Editon, Weast,R.C and Grasselli, J.G., ed(s)., CRC Press, Inc., Boca Raton, FL, 1989, 1. [all data]
Klapstein, MacPherson, et al., 1990
Klapstein, D.; MacPherson, C.D.; O'Brien, R.T.,
The photoelectron spectra and electronic structure of 2-carbonyl furans,
Can. J. Chem., 1990, 68, 747. [all data]